{"text_format":"1","workbook":"xlsx","n_sheets":3,"sheets":["Конструктив","Спецификация","Склад ДКС"],"not_rendered":{"charts":0,"images":0,"macros":1,"external_links":2,"defined_names":83,"comments":0,"pivot_tables":0},"unopened":[],"bounds":{"document_bytes":16777216,"sheet_cells":100000,"rows_first":2000,"rows_last":500,"rows_between":2000,"halvings":0,"cell_chars":16384,"cell_head_chars":4096},"cells_cut":0,"cells_raw":0,"read":"whole","date_system":"1900"}

{"sheet":"Конструктив","index":0,"n_rows":140,"n_cols":44,"rows_kept":140,"cut":false,"hidden":false,"merged":[[5,10,7,12]]}
[]
[]
[]
[]
[]
[null,null,null,null,null,null,null,"Параметры шкафа",null,"CQE",{"$f":"C50&CHAR(10)","v":"\n"}]
[null,null,null,null,null,null,null,"Ширина","Глубина","Высота"]
[null,null,null,null,null,null,null,800,600,2000]
[]
[null,"Комплект, крыша и основание, для шкафов CQE",{"$f":"VLOOKUP(\"R5KTB\"&Ширина/100&Глубина/100,Код,1,0)","v":"R5KTB86"},1,null,null,null,"Назначение",null,null,"Наименование","Код","Кол-во"]
[null,"Комплект, дно и крыша, для шкафов DAE",{"$f":"VLOOKUP(\"R5DTB\"&Ширина/100&Глубина/100,Код,1,0)","v":"R5DTB86"},1,null,null,null,"Крыша и дно",null,null,{"$f":"IF(J6=\"CQE\",B10,B11)","v":"Комплект, крыша и основание, для шкафов CQE"},{"$f":"IFERROR(VLOOKUP(K11,B3:C28,2,FALSE),\"-\")","v":"R5KTB86"},1]
[null,"Стойки вертикальные, 1 упаковка - 4шт.",{"$f":"VLOOKUP(\"R5KMN\"&Высота/100,Код,1,0)","v":"R5KMN20"},1,null,null,null,"Несущие вертикальные элементы",null,null,{"$f":"IF(J6=\"CQE\",B12,B13)","v":"Стойки вертикальные, 1 упаковка - 4шт."},{"$f":"IFERROR(VLOOKUP(K12,B4:C29,2,FALSE),\"-\")","v":"R5KMN20"},{"$f":"M11","v":1}]
[null,"Комплект боковых панелей",{"$f":"VLOOKUP(\"R5DL\"&Высота/100&Глубина/10,Код,1,0)","v":"R5DL2060"},1,null,null,null,"Рым-болты",null,null,"Нет",{"$f":"IF(K13=\"Нет\",\"-\",IF(J6=\"CQE\",\"R5A33\",\"R5A33\"))","v":"-"},{"$f":"M11","v":1}]
[null,"Панель глухая, для шкафов DAE/CQE",{"$f":"VLOOKUP(\"R5CRE\"&Высота/100&Ширина/10,Код,1,0)","v":"R5CRE2080"},1,null,null,null,"Боковые элементы",null,null,"Нет",{"$f":"IFERROR(VLOOKUP(K14,B6:C31,2,FALSE),\"-\")","v":"-"},{"$f":"M11","v":1}]
[null,"Дверь сплошная ",{"$f":"VLOOKUP(\"R5CPE\"&Высота/100&Ширина/10,Код,1,0)","v":"R5CPE2080"},1,null,null,null,"Задняя плоскость",null,null,"Панель глухая, для шкафов DAE/CQE",{"$f":"IFERROR(VLOOKUP(K15,B8:C33,2,FALSE),\"-\")","v":"R5CRE2080"},{"$f":"M11","v":1}]
[null,"Дверь прозрачная",{"$f":"VLOOKUP(\"R5CPTE\"&Высота/100&Ширина/10,Код,1,0)","v":"R5CPTE2080"},1,null,null,null,"Передняя плоскость",null,null,"Дверь сплошная ",{"$f":"IFERROR(VLOOKUP(K16,B9:C38,2,FALSE),\"-\")","v":"R5CPE2080"},{"$f":"M11","v":1}]
[null,null,null,null,null,null,null,"Монтажная плата",null,null,"Монтажная плата, для шкафов DAE/CQE",{"$f":"IFERROR(VLOOKUP(K17,B10:C40,2,FALSE),\"-\")","v":"R5PCE2080"},{"$f":"M11","v":1}]
[null,null,null,null,null,null,null,"Опорные элементы",null,null,"Цоколь 100 мм",{"$f":"IFERROR(VLOOKUP(K18,B10:C33,2,FALSE),\"-\")","v":"R5BP01"},{"$f":"M11","v":1}]
[null,"Дверь сплошная двустворчатая",{"$f":"VLOOKUP(R52,R53:S69,2,FALSE)","v":"R5CPE2081"},1,null,null,null,null,null,null,{"$f":"B25","v":"Панели цоколя фронтальные"},{"$f":"IFERROR(VLOOKUP(K19,B11:C34,2,FALSE),\"-\")","v":"R5NFP80"},{"$f":"M11","v":1}]
[null,null,null,null,null,null,null,null,null,null,{"$f":"B26","v":"Панели цоколя боковые"},{"$f":"IFERROR(VLOOKUP(K20,B12:C35,2,FALSE),\"-\")","v":"R5NFP60"},{"$f":"$M$11","v":1}]
[null,"Нет","-",null,null,null,null,"Фиксаторы к полу",null,null,"Да",{"$f":"IF(AND(K21=\"Да\",LEFT(K18,3)=\"Цок\"),\"R5KFP03\",\"-\")","v":"R5KFP03"},{"$f":"$M$11","v":1}]
[null,"Цоколь 100 мм","R5BP01",1,null,null,null,"Караман для документации",null,null,"Нет",{"$f":"IFERROR(VLOOKUP(K22,B16:C40,2,FALSE),\"-\")","v":"-"},{"$f":"$M$11","v":1}]
[null,"Цоколь 200 мм","R5BP02",1,null,null,null,"Вентиляцонные спейсеры",null,null,"Нет",{"$f":"IFERROR(VLOOKUP(K23,B16:C46,2,FALSE),\"-\")","v":"-"},{"$f":"$M$11","v":1}]
[null,"Нет","-"]
[null,{"$f":"IF(L18=\"-\",\"\",\"Панели цоколя фронтальные\")","v":"Панели цоколя фронтальные"},{"$f":"IF(L18=\"R5BP01\",VLOOKUP(\"R5NFP\"&Ширина/10,Код,1,0),IF(L18=\"R5BP02\",VLOOKUP(\"R5NFP\"&Ширина/100&2,Код,1,0),\"-\"))","v":"R5NFP80"},1]
[null,{"$f":"IF(L18=\"-\",\"\",\"Панели цоколя боковые\")","v":"Панели цоколя боковые"},{"$f":"IF(L18=\"R5BP01\",\"R5NFP\"&Глубина/10,IF(L18=\"R5BP02\",\"R5NFP\"&Глубина/100&2,\"-\"))","v":"R5NFP60"},1]
[null,null,"-"]
[null,{"$f":"IF(J6=\"DAE\",\"Нет\",\"Боковые панели 2 шт\")","v":"Боковые панели 2 шт"},{"$f":"VLOOKUP(\"R5LE\"&Высота/100&Глубина/100&2,Код,1,0)","v":"R5LE2062"},null,null,null,null,null,null,null,null,"Дополнительно",":"]
[null,{"$f":"IF(J6=\"DAE\",\"Нет\",\"Компл. для объединения шкафов\")","v":"Компл. для объединения шкафов"},"R5KE65",null,null,null,null,null,null,null,null,{"$f":"VLOOKUP(\"R5PDL\"&Глубина,Код,1,0)","v":"R5PDL600"},1]
[null,"Нет","-",null,null,null,null,null,null,null,null,{"$f":"VLOOKUP(\"R5TLE\"&Глубина,Код,1,0)","v":"R5TLE600"},1]
[null,"Профили для установки роликов",{"$f":"IFERROR(VLOOKUP(I8,C100:D103,2,FALSE),\"-\")","v":"R5A48"},1,null,null,null,null,null,null,null,{"$f":"VLOOKUP(\"R5PLE\"&Глубина,Код,1,0)","v":"R5PLE600"},1]
[null,"Комплект роликов",{"$f":"IFERROR(VLOOKUP(I8,C100:E103,3,FALSE),\"-\")","v":"R5A41"},1,null,null,null,null,null,null,null,{"$f":"VLOOKUP(\"R5PDF\"&Ширина,Код,1,0)","v":"R5PDF800"},1]
[null,"Монтажная плата, для шкафов DAE/CQE",{"$f":"VLOOKUP(\"R5PCE\"&Высота/100&Ширина/10,Код,1,0)","v":"R5PCE2080"},null,null,null,null,null,null,null,null,{"$f":"VLOOKUP(\"R5TFE\"&Ширина,Код,1,0)","v":"R5TFE800"},1]
[null,"Монтажная плата с боковой загрузкой",{"$f":"VLOOKUP(\"R5PCSE\"&Высота/100&Ширина/10,Код,1,0)","v":"R5PCSE2080"},null,null,null,null,null,null,null,null,{"$f":"VLOOKUP(\"R5TTE\"&Ширина,Код,1,0)","v":"R5TTE800"},1]
[null,"Нет","-",null,null,null,null,null,null,null,null,{"$f":"VLOOKUP(\"R5PAC\"&Ширина/10,Код,1,0)","v":"R5PAC80"},1]
[null,"Карман для документов стальной",{"$f":"VLOOKUP(\"R5NTE\"&Ширина/10,Код,1,0)","v":"R5NTE80"},null,null,null,null,null,null,null,null,{"$f":"VLOOKUP(\"R5PDV\"&Высота/100,Код,1,0)","v":"R5PDV20"},1]
[null,"Карман для документов пластиковый","R5A32",null,null,null,null,null,null,null,null,{"$f":"VLOOKUP(\"R5MVE\"&Высота/100,Код,1,0)","v":"R5MVE20"},1]
[null,"Нет","-",null,null,null,null,null,null,null,null,{"$f":"VLOOKUP(\"R5FPC\"&Ширина,Код,1,0)","v":"R5FPC800"},1]
[null,"Комплект для организации кабельного ввода",{"$f":"VLOOKUP(I125,I126:J133,2,FALSE)","v":"R5PFI2060"},null,null,null,null,null,null,null,null,{"$f":"VLOOKUP(\"R5FUC\"&Ширина/100&Глубина/100,Код,1,0)","v":"R5FUC86"},1]
[null,"Нет","-"]
[null,"Да"]
[null,"Нет"]
[]
[null,"Спейсер для крыши 20мм","R5SPA01"]
[null,"Спейсер для крыши 50мм","R5SPA02"]
[null,"Нет","-"]
[null,"DAE"]
[null,"CQE"]
[null,null,"Колонка ошибок"]
[null,null,{"$f":"IF(L11=\"-\",\"Без крыши и дна сборка шкафа невозможна!\",\"\")","v":""}]
[]
[null,null,{"$f":"H8&I8","v":"800600"},null,null,{"$f":"J8","v":2000},null,null,{"$f":"J8&H8","v":"2000800"},null,null,{"$f":"J8&H8","v":"2000800"},null,null,{"$f":"J8&H8","v":"2000800"},null,null,{"$f":"J8&H8","v":"2000800"},null,null,{"$f":"H8&I8","v":"800600"},null,null,{"$f":"H8&I8","v":"800600"},null,null,{"$f":"J8&H8","v":"2000800"},null,null,null,null,null,null,null,null,1000,600,{"$f":"AJ52&AK52","v":"1000600"},{"$f":"\"R5CPTE\"&AJ52/100&AK52/10","v":"R5CPTE1060"},null,1600,600,{"$f":"AO52&AP52","v":"1600600"},{"$f":"\"R5CPTED\"&AO52/100&AP52/10","v":"R5CPTED1660"}]
[null,null,"300400","R5KTB34",null,1400,"R5KMN14",null,"1000600","R5CRE1060",null,"1000600","R5PCE1060",null,"1000600","R5CPE1060",null,"1400800","R5CPE1481",null,"200500","R5ZE251",null,"200500","R5ZE252",null,"1000600","R5CPTE1060",null,300,"R5FP30",null,null,null,null,1000,800,"1000800",{"$f":"\"R5CPTE\"&AJ53/100&AK53/10","v":"R5CPTE1080"},null,1600,800,{"$f":"AO53&AP53","v":"1600800"},"R5CPTED1680"]
[null,null,"300500","R5KTB35",null,1600,"R5KMN16",null,"1000800","R5CRE1080",null,"1000800","R5PCE1080",null,"1000800","R5CPE1080",null,"14001200","R5CPE14120",null,"200600","R5ZE261",null,"200600","R5ZE262",null,"1000800","R5CPTE1080",null,400,"R5FP40",null,null,null,null,1000,1000,"10001000","R5CPTE10100",null,1800,600,"1800600","R5CPTED1860"]
[null,null,"300600","R5KTB36",null,1800,"R5KMN18",null,"10001000","R5CRE10100",null,"10001000","R5PCE10100",null,"10001000","R5CPE10100",null,"14001600","R5CPE14160",null,"200800","R5ZE281",null,"200800","R5ZE282",null,"10001000","R5CPTE10100",null,600,"R5FP60",null,null,null,null,1200,600,"1200600","R5CPTE1260",null,1800,800,"1800800","R5CPTED1880"]
[null,null,"300800","R5KTB38",null,2000,"R5KMN20",null,"1200600","R5CRE1260",null,"1200600","R5PCE1260",null,"1200600","R5CPE1260",null,"1600800","R5CPE1681",null,"300400","R5BP01",null,"300400","R5ZE342",null,"1200600","R5CPTE1260",null,800,"R5FP80",null,null,null,null,1200,800,"1200800","R5CPTE1280",null,2000,600,"2000600","R5CPTED2060"]
[null,null,"3001000","R5KTB310",null,2200,"R5KMN22",null,"1200800","R5CRE1280",null,"1200800","R5PCE1280",null,"1200800","R5CPE1280",null,"16001000","R5CPE16101",null,"300500","R5ZE351",null,"300500","R5ZE352",null,"1200800","R5CPTE1280",null,1000,"R5FP100",null,null,null,null,1200,1000,"12001000","R5CPTE12100",null,2000,800,"2000800","R5CPTED2080"]
[null,null,"400400","R5KTB44",null,null,null,null,"12001000","R5CRE12100",null,"12001000","R5PCE12100",null,"12001000","R5CPE12100",null,"16001200","R5CPE16120",null,"300600","R5BP01",null,"300600","R5ZE362",null,"12001000","R5CPTE12100",null,1200,"R5FP120",null,null,null,null,1400,600,"1400600","R5CPTE1460",null,2200,600,"2200600","R5CPTED2260"]
[null,null,"400500","R5KTB45",null,null,null,null,"1400600","R5CRE1460",null,"1400600","R5PCE1460",null,"1400600","R5CPE1460",null,"1800800","R5CPE1881",null,"300800","R5BP01",null,"300800","R5ZE382",null,"1400600","R5CPTE1460",null,null,null,null,null,null,null,1400,800,"1400800","R5CPTE1480",null,2200,800,"2200800","R5CPTED2280"]
[null,null,"400600","R5KTB46",null,300,null,null,"1400800","R5CRE1480",null,"1400800","R5PCE1480",null,"1400800","R5CPE1480",null,"18001000","R5CPE18101",null,"400400","R5BP01",null,"400400","R5ZE442",null,"1400800","R5CPTE1480",null,null,null,null,null,null,null,1600,400,"1600400","R5CPTE1640"]
{"$rows_left_out":81}
{"sheet":"Спецификация","index":1,"n_rows":748,"n_cols":6,"rows_kept":748,"cut":false,"hidden":false,"merged":[]}
[]
[null,"Код","Колич.","Б.ЕдИзм","Код.Ед. Измер","Описание"]
[null,"R5KTB86",1,{"$f":"IFERROR(VLOOKUP(B3,'Склад ДКС'!A:C,3,0),\"\")","v":"Штука"},null,{"$f":"IFERROR(VLOOKUP(B3,'Склад ДКС'!A:C,2,0),\"\")","v":"Комплект, крыша и основание, для шкафов CQE, 800 x 600 мм"}]
[null,"R5KMN20",1,{"$f":"IFERROR(VLOOKUP(B4,'Склад ДКС'!A:C,3,0),\"\")","v":"Упаковка"},null,{"$f":"IFERROR(VLOOKUP(B4,'Склад ДКС'!A:C,2,0),\"\")","v":"Стойки вертикальные, В=2000мм, без дополнительных креплений, 4шт RAL7035"}]
[null,"R5CRE2080",1,{"$f":"IFERROR(VLOOKUP(B5,'Склад ДКС'!A:C,3,0),\"\")","v":"Штука"},null,{"$f":"IFERROR(VLOOKUP(B5,'Склад ДКС'!A:C,2,0),\"\")","v":"Панель задняя, для шкафов DAE/CQE, 2000 x 800 мм"}]
[null,"R5CPE2080",1,{"$f":"IFERROR(VLOOKUP(B6,'Склад ДКС'!A:C,3,0),\"\")","v":"Штука"},null,{"$f":"IFERROR(VLOOKUP(B6,'Склад ДКС'!A:C,2,0),\"\")","v":"Дверь сплошная для шкафов CQE/DAE ВхШ 2000х800 мм"}]
[null,"R5PCE2080",1,{"$f":"IFERROR(VLOOKUP(B7,'Склад ДКС'!A:C,3,0),\"\")","v":"Штука"},null,{"$f":"IFERROR(VLOOKUP(B7,'Склад ДКС'!A:C,2,0),\"\")","v":"Монтажная плата, для шкафов DAE/CQE 2000 x 800 мм"}]
[null,"R5BP01",1,{"$f":"IFERROR(VLOOKUP(B8,'Склад ДКС'!A:C,3,0),\"\")","v":"Комплект"},null,{"$f":"IFERROR(VLOOKUP(B8,'Склад ДКС'!A:C,2,0),\"\")","v":"Комплект угловых элементов с пластиковыми заглушками, В =100 мм, 1 кмп =4 шт."}]
[null,"R5NFP80",1,{"$f":"IFERROR(VLOOKUP(B9,'Склад ДКС'!A:C,3,0),\"\")","v":"Комплект"},null,{"$f":"IFERROR(VLOOKUP(B9,'Склад ДКС'!A:C,2,0),\"\")","v":"Комплект панелей цоколя, Ш/Г=800 мм, В=100 мм, 1 кмп = 2 шт."}]
[null,"R5NFP60",1,{"$f":"IFERROR(VLOOKUP(B10,'Склад ДКС'!A:C,3,0),\"\")","v":"Комплект"},null,{"$f":"IFERROR(VLOOKUP(B10,'Склад ДКС'!A:C,2,0),\"\")","v":"Комплект панелей цоколя, Ш/Г=600 мм, В=100 мм, 1 кмп = 2 шт."}]
[null,"R5KFP03",1,{"$f":"IFERROR(VLOOKUP(B11,'Склад ДКС'!A:C,3,0),\"\")","v":"Комплект"},null,{"$f":"IFERROR(VLOOKUP(B11,'Склад ДКС'!A:C,2,0),\"\")","v":"Фиксаторы для цоколя 200 мм, 1 комплект - 4 шт."}]
[null,"Дополнительно",":",{"$f":"IFERROR(VLOOKUP(B12,'Склад ДКС'!A:C,3,0),\"\")","v":""},null,{"$f":"IFERROR(VLOOKUP(B12,'Склад ДКС'!A:C,2,0),\"\")","v":""}]
[null,"R5PDL600",1,{"$f":"IFERROR(VLOOKUP(B13,'Склад ДКС'!A:C,3,0),\"\")","v":"Упаковка"},null,{"$f":"IFERROR(VLOOKUP(B13,'Склад ДКС'!A:C,2,0),\"\")","v":"Рейка боковая, широкая, для шкафов CQE глубиной 600 мм, 1 упаковка -4шт."}]
[null,"R5TLE600",1,{"$f":"IFERROR(VLOOKUP(B14,'Склад ДКС'!A:C,3,0),\"\")","v":"Упаковка"},null,{"$f":"IFERROR(VLOOKUP(B14,'Склад ДКС'!A:C,2,0),\"\")","v":"Рейки боковые, для шкафов CQE глубиной 600мм, 1 упаковка - 4шт."}]
[null,"R5PLE600",1,{"$f":"IFERROR(VLOOKUP(B15,'Склад ДКС'!A:C,3,0),\"\")","v":"Упаковка"},null,{"$f":"IFERROR(VLOOKUP(B15,'Склад ДКС'!A:C,2,0),\"\")","v":"Рейки боковые, специальная, для шкафов CQE глубиной 600мм, 1 упаковка - 4шт."}]
[null,"R5PDF800",1,{"$f":"IFERROR(VLOOKUP(B16,'Склад ДКС'!A:C,3,0),\"\")","v":"Упаковка"},null,{"$f":"IFERROR(VLOOKUP(B16,'Склад ДКС'!A:C,2,0),\"\")","v":"Рейки поперечные, широкая, для шкафов CQE Ш=800мм, 1 упаковка - 4шт."}]
[null,"R5TFE800",1,{"$f":"IFERROR(VLOOKUP(B17,'Склад ДКС'!A:C,3,0),\"\")","v":"Упаковка"},null,{"$f":"IFERROR(VLOOKUP(B17,'Склад ДКС'!A:C,2,0),\"\")","v":"Рейки поперечные, для шкафов CQE Ш=800мм, 1 упаковка - 4шт."}]
[null,"R5TTE800",1,{"$f":"IFERROR(VLOOKUP(B18,'Склад ДКС'!A:C,3,0),\"\")","v":"Упаковка"},null,{"$f":"IFERROR(VLOOKUP(B18,'Склад ДКС'!A:C,2,0),\"\")","v":"Рейки усиленная, для тяжёлого оборудования Ш=800мм, 1 упаковка - 2шт."}]
[null,"R5PAC80",1,{"$f":"IFERROR(VLOOKUP(B19,'Склад ДКС'!A:C,3,0),\"\")","v":"Упаковка"},null,{"$f":"IFERROR(VLOOKUP(B19,'Склад ДКС'!A:C,2,0),\"\")","v":"Рейки для фиксации кабеля, для шкафов DAE/CQE Ш=800мм, 1 упаковка - 2шт."}]
[null,"R5PDV20",1,{"$f":"IFERROR(VLOOKUP(B20,'Склад ДКС'!A:C,3,0),\"\")","v":"Упаковка"},null,{"$f":"IFERROR(VLOOKUP(B20,'Склад ДКС'!A:C,2,0),\"\")","v":"Рейки вертикальные, широкая, для шкафов CQE В=2000мм, 1 упаковка - 2шт."}]
[null,"R5MVE20",1,{"$f":"IFERROR(VLOOKUP(B21,'Склад ДКС'!A:C,3,0),\"\")","v":"Упаковка"},null,{"$f":"IFERROR(VLOOKUP(B21,'Склад ДКС'!A:C,2,0),\"\")","v":"Стойки вертикальные, для поддержки разделителей, В=2000мм, 1 упаковка - 2шт."}]
[null,"R5FPC800",1,{"$f":"IFERROR(VLOOKUP(B22,'Склад ДКС'!A:C,3,0),\"\")","v":"Штука"},null,{"$f":"IFERROR(VLOOKUP(B22,'Склад ДКС'!A:C,2,0),\"\")","v":"Уплотнитель для ввода кабеля, для шкафов DAE/CQE шириной 800 мм"}]
[null,"R5FUC86",1,{"$f":"IFERROR(VLOOKUP(B23,'Склад ДКС'!A:C,3,0),\"\")","v":"Штука"},null,{"$f":"IFERROR(VLOOKUP(B23,'Склад ДКС'!A:C,2,0),\"\")","v":"Дно сплошное, для шкафов DAE/CQE 800 x 600 мм"}]
[null,null,null,{"$f":"IFERROR(VLOOKUP(B24,'Склад ДКС'!A:C,3,0),\"\")","v":""},null,{"$f":"IFERROR(VLOOKUP(B24,'Склад ДКС'!A:C,2,0),\"\")","v":""}]
[null,null,null,{"$f":"IFERROR(VLOOKUP(B25,'Склад ДКС'!A:C,3,0),\"\")","v":""},null,{"$f":"IFERROR(VLOOKUP(B25,'Склад ДКС'!A:C,2,0),\"\")","v":""}]
[null,null,null,{"$f":"IFERROR(VLOOKUP(B26,'Склад ДКС'!A:C,3,0),\"\")","v":""},null,{"$f":"IFERROR(VLOOKUP(B26,'Склад ДКС'!A:C,2,0),\"\")","v":""}]
[null,null,null,{"$f":"IFERROR(VLOOKUP(B27,'Склад ДКС'!A:C,3,0),\"\")","v":""},null,{"$f":"IFERROR(VLOOKUP(B27,'Склад ДКС'!A:C,2,0),\"\")","v":""}]
[null,null,null,{"$f":"IFERROR(VLOOKUP(B28,'Склад ДКС'!A:C,3,0),\"\")","v":""},null,{"$f":"IFERROR(VLOOKUP(B28,'Склад ДКС'!A:C,2,0),\"\")","v":""}]
[null,null,null,{"$f":"IFERROR(VLOOKUP(B29,'Склад ДКС'!A:C,3,0),\"\")","v":""},null,{"$f":"IFERROR(VLOOKUP(B29,'Склад ДКС'!A:C,2,0),\"\")","v":""}]
[null,null,null,{"$f":"IFERROR(VLOOKUP(B30,'Склад ДКС'!A:C,3,0),\"\")","v":""},null,{"$f":"IFERROR(VLOOKUP(B30,'Склад ДКС'!A:C,2,0),\"\")","v":""}]
[null,null,null,{"$f":"IFERROR(VLOOKUP(B31,'Склад ДКС'!A:C,3,0),\"\")","v":""},null,{"$f":"IFERROR(VLOOKUP(B31,'Склад ДКС'!A:C,2,0),\"\")","v":""}]
[null,null,null,{"$f":"IFERROR(VLOOKUP(B32,'Склад ДКС'!A:C,3,0),\"\")","v":""},null,{"$f":"IFERROR(VLOOKUP(B32,'Склад ДКС'!A:C,2,0),\"\")","v":""}]
[null,null,null,{"$f":"IFERROR(VLOOKUP(B33,'Склад ДКС'!A:C,3,0),\"\")","v":""},null,{"$f":"IFERROR(VLOOKUP(B33,'Склад ДКС'!A:C,2,0),\"\")","v":""}]
[null,null,null,{"$f":"IFERROR(VLOOKUP(B34,'Склад ДКС'!A:C,3,0),\"\")","v":""},null,{"$f":"IFERROR(VLOOKUP(B34,'Склад ДКС'!A:C,2,0),\"\")","v":""}]
[null,null,null,{"$f":"IFERROR(VLOOKUP(B35,'Склад ДКС'!A:C,3,0),\"\")","v":""},null,{"$f":"IFERROR(VLOOKUP(B35,'Склад ДКС'!A:C,2,0),\"\")","v":""}]
[null,null,null,{"$f":"IFERROR(VLOOKUP(B36,'Склад ДКС'!A:C,3,0),\"\")","v":""},null,{"$f":"IFERROR(VLOOKUP(B36,'Склад ДКС'!A:C,2,0),\"\")","v":""}]
[null,null,null,{"$f":"IFERROR(VLOOKUP(B37,'Склад ДКС'!A:C,3,0),\"\")","v":""},null,{"$f":"IFERROR(VLOOKUP(B37,'Склад ДКС'!A:C,2,0),\"\")","v":""}]
[null,null,null,{"$f":"IFERROR(VLOOKUP(B38,'Склад ДКС'!A:C,3,0),\"\")","v":""},null,{"$f":"IFERROR(VLOOKUP(B38,'Склад ДКС'!A:C,2,0),\"\")","v":""}]
[null,null,null,{"$f":"IFERROR(VLOOKUP(B39,'Склад ДКС'!A:C,3,0),\"\")","v":""},null,{"$f":"IFERROR(VLOOKUP(B39,'Склад ДКС'!A:C,2,0),\"\")","v":""}]
[null,null,null,{"$f":"IFERROR(VLOOKUP(B40,'Склад ДКС'!A:C,3,0),\"\")","v":""},null,{"$f":"IFERROR(VLOOKUP(B40,'Склад ДКС'!A:C,2,0),\"\")","v":""}]
[null,null,null,{"$f":"IFERROR(VLOOKUP(B41,'Склад ДКС'!A:C,3,0),\"\")","v":""},null,{"$f":"IFERROR(VLOOKUP(B41,'Склад ДКС'!A:C,2,0),\"\")","v":""}]
[null,null,null,{"$f":"IFERROR(VLOOKUP(B42,'Склад ДКС'!A:C,3,0),\"\")","v":""},null,{"$f":"IFERROR(VLOOKUP(B42,'Склад ДКС'!A:C,2,0),\"\")","v":""}]
[null,null,null,{"$f":"IFERROR(VLOOKUP(B43,'Склад ДКС'!A:C,3,0),\"\")","v":""},null,{"$f":"IFERROR(VLOOKUP(B43,'Склад ДКС'!A:C,2,0),\"\")","v":""}]
[null,null,null,{"$f":"IFERROR(VLOOKUP(B44,'Склад ДКС'!A:C,3,0),\"\")","v":""},null,{"$f":"IFERROR(VLOOKUP(B44,'Склад ДКС'!A:C,2,0),\"\")","v":""}]
[null,null,null,{"$f":"IFERROR(VLOOKUP(B45,'Склад ДКС'!A:C,3,0),\"\")","v":""},null,{"$f":"IFERROR(VLOOKUP(B45,'Склад ДКС'!A:C,2,0),\"\")","v":""}]
[null,null,null,{"$f":"IFERROR(VLOOKUP(B46,'Склад ДКС'!A:C,3,0),\"\")","v":""},null,{"$f":"IFERROR(VLOOKUP(B46,'Склад ДКС'!A:C,2,0),\"\")","v":""}]
[null,null,null,{"$f":"IFERROR(VLOOKUP(B47,'Склад ДКС'!A:C,3,0),\"\")","v":""},null,{"$f":"IFERROR(VLOOKUP(B47,'Склад ДКС'!A:C,2,0),\"\")","v":""}]
[null,null,null,{"$f":"IFERROR(VLOOKUP(B48,'Склад ДКС'!A:C,3,0),\"\")","v":""},null,{"$f":"IFERROR(VLOOKUP(B48,'Склад ДКС'!A:C,2,0),\"\")","v":""}]
[null,null,null,{"$f":"IFERROR(VLOOKUP(B49,'Склад ДКС'!A:C,3,0),\"\")","v":""},null,{"$f":"IFERROR(VLOOKUP(B49,'Склад ДКС'!A:C,2,0),\"\")","v":""}]
[null,null,null,{"$f":"IFERROR(VLOOKUP(B50,'Склад ДКС'!A:C,3,0),\"\")","v":""},null,{"$f":"IFERROR(VLOOKUP(B50,'Склад ДКС'!A:C,2,0),\"\")","v":""}]
[null,null,null,{"$f":"IFERROR(VLOOKUP(B51,'Склад ДКС'!A:C,3,0),\"\")","v":""},null,{"$f":"IFERROR(VLOOKUP(B51,'Склад ДКС'!A:C,2,0),\"\")","v":""}]
[null,null,null,{"$f":"IFERROR(VLOOKUP(B52,'Склад ДКС'!A:C,3,0),\"\")","v":""},null,{"$f":"IFERROR(VLOOKUP(B52,'Склад ДКС'!A:C,2,0),\"\")","v":""}]
[null,null,null,{"$f":"IFERROR(VLOOKUP(B53,'Склад ДКС'!A:C,3,0),\"\")","v":""},null,{"$f":"IFERROR(VLOOKUP(B53,'Склад ДКС'!A:C,2,0),\"\")","v":""}]
[null,null,null,{"$f":"IFERROR(VLOOKUP(B54,'Склад ДКС'!A:C,3,0),\"\")","v":""},null,{"$f":"IFERROR(VLOOKUP(B54,'Склад ДКС'!A:C,2,0),\"\")","v":""}]
[null,null,null,{"$f":"IFERROR(VLOOKUP(B55,'Склад ДКС'!A:C,3,0),\"\")","v":""},null,{"$f":"IFERROR(VLOOKUP(B55,'Склад ДКС'!A:C,2,0),\"\")","v":""}]
[null,null,null,{"$f":"IFERROR(VLOOKUP(B56,'Склад ДКС'!A:C,3,0),\"\")","v":""},null,{"$f":"IFERROR(VLOOKUP(B56,'Склад ДКС'!A:C,2,0),\"\")","v":""}]
[null,null,null,{"$f":"IFERROR(VLOOKUP(B57,'Склад ДКС'!A:C,3,0),\"\")","v":""},null,{"$f":"IFERROR(VLOOKUP(B57,'Склад ДКС'!A:C,2,0),\"\")","v":""}]
[null,null,null,{"$f":"IFERROR(VLOOKUP(B58,'Склад ДКС'!A:C,3,0),\"\")","v":""},null,{"$f":"IFERROR(VLOOKUP(B58,'Склад ДКС'!A:C,2,0),\"\")","v":""}]
[null,null,null,{"$f":"IFERROR(VLOOKUP(B59,'Склад ДКС'!A:C,3,0),\"\")","v":""},null,{"$f":"IFERROR(VLOOKUP(B59,'Склад ДКС'!A:C,2,0),\"\")","v":""}]
[null,null,null,{"$f":"IFERROR(VLOOKUP(B60,'Склад ДКС'!A:C,3,0),\"\")","v":""},null,{"$f":"IFERROR(VLOOKUP(B60,'Склад ДКС'!A:C,2,0),\"\")","v":""}]
{"$rows_left_out":689}
{"sheet":"Склад ДКС","index":2,"n_rows":1672,"n_cols":3,"rows_kept":1672,"cut":false,"hidden":true,"merged":[]}
["Код","Описание","Б.ЕдИзм"]
[]
[]
["R5CQE1866A","Шкаф напольный CQE собранный с дверью и задней панелью ВхШхГ 1800x600x600 мм","Штука"]
["R5CQE1884A","Шкаф напольный CQE собранный с дверью и задней панелью ВхШхГ 1800x800x400 мм","Штука"]
["R5CQE1886A","Шкаф напольный CQE собранный с дверью и задней панелью ВхШхГ 1800x800x600 мм","Штука"]
["R5CQE20104A","Шкаф напольный CQE собранный с дверью и задней панелью ВхШхГ 2000x1000x400 мм","Штука"]
["R5CQE20106A","Шкаф напольный CQE собранный с дверью и задней панелью ВхШхГ 2000x1000x600 мм","Штука"]
["R5CQE2066A","Шкаф напольный CQE собранный с дверью и задней панелью ВхШхГ 2000x600x600 мм","Штука"]
["R5CQE2084A","Шкаф напольный CQE собранный с дверью и задней панелью ВхШхГ 2000x800x400 мм","Штука"]
["R5CQE2086A","Шкаф напольный CQE собранный с дверью и задней панелью ВхШхГ 2000x800x600 мм","Штука"]
[]
["R5KTB1010","Комплект, крыша и основание, для шкафов CQE, 1000 x 1000 мм","Штука"]
["R5KTB1012","Комплект, крыша и основание, для шкафов CQE, 1000 x 1200 мм","Штука"]
["R5KTB104","Комплект, крыша и основание, для шкафов CQE, 1000 x 400 мм","Штука"]
["R5KTB105","Комплект, крыша и основание, для шкафов CQE, 1000 x 500 мм","Штука"]
["R5KTB106","Комплект, крыша и основание, для шкафов CQE, 1000 x 600 мм","Штука"]
["R5KTB108","Комплект, крыша и основание, для шкафов CQE, 1000 x 800 мм","Штука"]
["R5KTB124","Комплект, крыша и основание, для шкафов CQE, 1200 x 400 мм","Штука"]
["R5KTB125","Комплект, крыша и основание, для шкафов CQE, 1200 x 500 мм","Штука"]
["R5KTB126","Комплект, крыша и основание, для шкафов CQE, 1200 x 600 мм","Штука"]
["R5KTB128","Комплект, крыша и основание, для шкафов CQE, 1200 x 800 мм","Штука"]
["R5KTB144","Комплект, крыша и основание, для шкафов CQE, 1400 x 400 мм","Штука"]
["R5KTB145","Комплект, крыша и основание, для шкафов CQE, 1400 x 500 мм","Штука"]
["R5KTB146","Комплект, крыша и основание, для шкафов CQE, 1400 x 600 мм","Штука"]
["R5KTB148","Комплект, крыша и основание, для шкафов CQE, 1400 x 800 мм","Штука"]
["R5KTB164","Комплект, крыша и основание, для шкафов CQE, 1600 x 400 мм","Штука"]
["R5KTB165","Комплект, крыша и основание, для шкафов CQE, 1600 x 500 мм","Штука"]
["R5KTB166","Комплект, крыша и основание, для шкафов CQE, 1600 x 600 мм","Штука"]
["R5KTB168","Комплект, крыша и основание, для шкафов CQE, 1600 x 800 мм","Штука"]
["R5KTB310","Комплект, крыша и основание, для шкафов CQE, 300 x 1000 мм","Штука"]
["R5KTB312","Комплект, крыша и основание, для шкафов CQE, 300 x 1200 мм","Штука"]
["R5KTB34","Комплект, крыша и основание, для шкафов CQE, 300 x 400 мм","Штука"]
["R5KTB35","Комплект, крыша и основание, для шкафов CQE, 300 x 500 мм","Штука"]
["R5KTB36","Комплект, крыша и основание, для шкафов CQE, 300 x 600 мм","Штука"]
["R5KTB38","Комплект, крыша и основание, для шкафов CQE, 300 x 800 мм","Штука"]
["R5KTB410","Комплект, крыша и основание, для шкафов CQE, 400 x 1000 мм","Штука"]
["R5KTB412","Комплект, крыша и основание, для шкафов CQE, 400 x 1200 мм","Штука"]
["R5KTB44","Комплект, крыша и основание, для шкафов CQE, 400 x 400 мм","Штука"]
["R5KTB45","Комплект, крыша и основание, для шкафов CQE, 400 x 500 мм","Штука"]
["R5KTB46","Комплект, крыша и основание, для шкафов CQE, 400 x 600 мм","Штука"]
["R5KTB48","Комплект, крыша и основание, для шкафов CQE, 400 x 800 мм","Штука"]
["R5KTB610","Комплект, крыша и основание, для шкафов CQE, 600х1000 мм","Штука"]
["R5KTB612","Комплект, крыша и основание, для шкафов CQE, 600х1200 мм","Штука"]
["R5KTB64","Комплект, крыша и основание, для шкафов CQE, 600 x 400 мм","Штука"]
["R5KTB65","Комплект, крыша и основание, для шкафов CQE, 600 x 500 мм","Штука"]
["R5KTB66","Комплект, крыша и основание, для шкафов CQE, 600 x 600 мм","Штука"]
["R5KTB68","Комплект, крыша и основание, для шкафов CQE, 600 x 800 мм","Штука"]
["R5KTB810","Комплект, крыша и основание, для шкафов CQE, 800х1000 мм","Штука"]
["R5KTB812","Комплект, крыша и основание, для шкафов CQE, 800х1200 мм","Штука"]
["R5KTB84","Комплект, крыша и основание, для шкафов CQE, 800 x 400 мм","Штука"]
["R5KTB85","Комплект, крыша и основание, для шкафов CQE, 800 x 500 мм","Штука"]
["R5KTB86","Комплект, крыша и основание, для шкафов CQE, 800 x 600 мм","Штука"]
["R5KTB88","Комплект, крыша и основание, для шкафов CQE, 800 x 800 мм","Штука"]
[]
["R5KMN10","Стойки вертикальные, В=1000мм, без дополнительных креплений, 4шт RAL7035","Упаковка"]
["R5KMN12","Стойки вертикальные, В=1200мм, без дополнительных креплений, 4шт RAL7035","Упаковка"]
["R5KMN14","Стойки вертикальные, В=1400мм, без дополнительных креплений, 1 упаковка - 4шт.","Упаковка"]
["R5KMN16","Стойки вертикальные, В=1600мм, без дополнительных креплений, 1 упаковка - 4шт.","Упаковка"]
["R5KMN18","Стойки вертикальные, В=1800мм, без дополнительных креплений, 4шт RAL7035","Упаковка"]
{"$rows_left_out":1612}