{"text_format":"1","workbook":"xlsx","n_sheets":4,"sheets":["Конфигуратор","Таблица характеристик моделей","Списки","Лист1"],"not_rendered":{"charts":0,"images":2,"macros":1,"external_links":0,"defined_names":2,"comments":0,"pivot_tables":0},"unopened":[],"bounds":{"document_bytes":16777216,"sheet_cells":100000,"rows_first":2000,"rows_last":500,"rows_between":2000,"halvings":0,"cell_chars":16384,"cell_head_chars":4096},"cells_cut":0,"cells_raw":0,"read":"whole","date_system":"1900"}

{"sheet":"Конфигуратор","index":0,"n_rows":623,"n_cols":12,"rows_kept":623,"cut":false,"hidden":false,"merged":[[4,4,4,7],[5,4,9,7],[25,0,25,1],[4,0,4,2],[5,0,9,2],[14,0,14,1],[15,4,15,7],[16,4,16,7],[18,4,18,7],[19,4,19,7]]}
[]
[]
[]
[]
["Конфигуратор \"Преобразователи частоты серии V2000 Mitra\"",null,null,null,"Спецификация"]
["Данный конфигуратор предназначен для упрощения выбора модели преобразователя частоты под параметры асинхронного двигателя.\nИнструкция:\n1. Укажите планируемый тип питания преобразователя частоты.\n2. Укажите номинальную мощность, а так же необходимы ли сопутствующие аксессуары.\n3. Нажмите кнопку \"Создать спецификацию\".",null,null,null,"Результат:\nВ разделе \"Спецификация\" указан артикул модели преобразователя частоты серии V20000, необходимая для корректного управления вашим асинхронным двигателем, а также список доступных для неё акссесуаров (при необходимости вывода).\nПримечания:\nСпецификация содержит основые параметры выбранной модели преобразователя частоты."]
[]
[]
[]
[]
[]
[]
[]
[null,null,null,null,null,null,null,null,null,null,null,"Содержимое заголовка"]
["Выбор параметров",null,null,null,"№ позиции","Артикул","Наименование","Ссылка",null,null,null,{"$f":"LEFT(E15,12)","v":"№ позиции"}]
[null,null,null,null,"Спецификация 1",null,null,null,null,null,null,{"$f":"LEFT(E16,12)","v":"Спецификация"}]
["1. Тип питания","3-ф, 380В, 50/60 гц",{"$f":"IF(B17=\"\",\"Выберите тип питания\",\"\")","v":""},null,"Преобразователь частоты серии V2000 Mitra",null,null,null,null,null,null,"Преобразоват"]
[null,null,null,null,1,"V2000-S0P75G","Преобразователь частоты, 1ф. питание 220В, выходная мощность 0,75 кВт, встроенный тормозной прерыватель и ЭМС фильтр","https://www.dkc.ru/ru/catalog/1897/V2000-S0P75G/",null,null,null,"1"]
["2. Номинальная мощность двигателя, кВт",0.75,{"$f":"IF(B19=\"\",\"Выберите мощность двигателя\", IF(B17&B19=\"1-ф, 220В, 50/60 гц\",\"Для питания 1-ф, 220В, номинальная мощность двигателя от 0,4 до 2,2 кВт\",IF(B17&B19=\"3-ф, 380В, 50/60 гц\",\"Для питания 3-ф, 380В, номинальная мощность двигателя от 0,75 до 500 кВт\",IF(B17=\"1-ф, 220В, 50/60 гц\",IF(B19>2.2,\"Для питания 1-ф, 220В, номинальная мощность двигателя составляет не более 2,2 кВт\",\"\"),IF(B17=\"3-ф, 380В, 50/60 гц\",IF(B19<0.75,\"Для питания 3-ф, 380В, номинальная мощность двигателя не менее 0,75 кВт\",\"\"),\"\")))))","v":""},null,"Спецификация 2",null,null,null,null,null,null,"Спецификация"]
[null,null,null,null,"Преобразователь частоты серии V2000 Mitra",null,null,null,null,null,null,"Преобразоват"]
["3. Номинальный ток двигателя, А",{"$f":"IF(Конфигуратор!$B$19=\"\",\"\",IF(Конфигуратор!$B$19=0.4,2.5,IF(Конфигуратор!$B$19=0.75,IF(Конфигуратор!$B$17=\"1-ф, 220В, 50/60 гц\",4,2.3),IF(Конфигуратор!$B$19=1.5,IF(Конфигуратор!$B$17=\"1-ф, 220В, 50/60 гц\",7.5,3.7),IF(Конфигуратор!$B$19=2.2,IF(Конфигуратор!$B$17=\"1-ф, 220В, 50/60 гц\",10,5.5),IF(Конфигуратор!$B$17=\"\",\"\",VLOOKUP(Конфигуратор!$B$19,'Таблица характеристик моделей'!E10:F35,2,0)))))))","v":2.2999999999999998},{"$f":"IF(B21=\"\",\"Выберите ток двигателя\",IF(B17&B21=\"1-ф, 220В, 50/60 гц\",\"Для питания 1-ф, 220В, номинальный ток двигателя от 2,5 до 10 А\",IF(B17&B21=\"3-ф, 380В, 50/60 гц\",\"Для питания 3-ф, 380В, номинальный ток двигателя от 2,3 до 950 А\",IF(B17=\"1-ф, 220В, 50/60 гц\",IF(B21>10,\"Для питания 1-ф, 220В, номинальный ток двигателя не более 10 А\",\"\"),IF(B17=\"3-ф, 380В, 50/60 гц\",IF(B21<2.3,\"Для питания 3-ф, 380В, номинальный ток двигателя не менее 2,3 А\",\"\"),\"\")))))","v":""},null,2,"V2000-T0P75G","Преобразователь частоты, 3ф. питание 380В, выходная мощность 0,75 кВт, встроенный тормозной прерыватель и ЭМС фильтр","https://www.dkc.ru/ru/catalog/1897/V2000-T0P75G/",null,null,null,"2"]
[null,null,null,null,null,null,null,null,null,null,null,""]
["4. Выводить аксессуары",{"$f":"IF(Конфигуратор!$B$17=\"\",\"\",\"Нет\")","v":"Нет"},{"$f":"IF(B23<>\"Да\",\"При необходимости подбора аксессуаров выберите ДА\",\"\")","v":"При необходимости подбора аксессуаров выберите ДА"},null,null,null,null,null,null,null,null,""]
[null,null,null,null,null,null,null,null,null,null,null,""]
[null,null,null,null,null,null,null,null,null,null,null,""]
[null,null,null,null,null,null,null,null,null,null,null,""]
[null,null,null,null,null,null,null,null,null,null,null,""]
[null,null,null,null,null,null,null,null,null,null,null,""]
[null,null,null,null,null,null,null,null,null,null,null,""]
[null,null,null,null,null,null,null,null,null,null,null,""]
[null,null,null,null,null,null,null,null,null,null,null,""]
[null,null,null,null,null,null,null,null,null,null,null,""]
[null,null,null,null,null,null,null,null,null,null,null,""]
[null,null,null,null,null,null,null,null,null,null,null,""]
[null,null,null,null,null,null,null,null,null,null,null,""]
[null,null,null,null,null,null,null,null,null,null,null,""]
[null,null,null,null,null,null,null,null,null,null,null,""]
[null,null,null,null,null,null,null,null,null,null,null,""]
[null,null,null,null,null,null,null,null,null,null,null,""]
[null,null,null,null,null,null,null,null,null,null,null,""]
[null,null,null,null,null,null,null,null,null,null,null,""]
[null,null,null,null,null,null,null,null,null,null,null,""]
[null,null,null,null,null,null,null,null,null,null,null,""]
[null,null,null,null,null,null,null,null,null,null,null,""]
[null,null,null,null,null,null,null,null,null,null,null,""]
[null,null,null,null,null,null,null,null,null,null,null,""]
[null,null,null,null,null,null,null,null,null,null,null,""]
[null,null,null,null,null,null,null,null,null,null,null,""]
[null,null,null,null,null,null,null,null,null,null,null,""]
[null,null,null,null,null,null,null,null,null,null,null,""]
[null,null,null,null,null,null,null,null,null,null,null,""]
[null,null,null,null,null,null,null,null,null,null,null,""]
[null,null,null,null,null,null,null,null,null,null,null,""]
[null,null,null,null,null,null,null,null,null,null,null,""]
[null,null,null,null,null,null,null,null,null,null,null,""]
[null,null,null,null,null,null,null,null,null,null,null,""]
[null,null,null,null,null,null,null,null,null,null,null,""]
[null,null,null,null,null,null,null,null,null,null,null,""]
[null,null,null,null,null,null,null,null,null,null,null,""]
[null,null,null,null,null,null,null,null,null,null,null,""]
[null,null,null,null,null,null,null,null,null,null,null,""]
[null,null,null,null,null,null,null,null,null,null,null,""]
[null,null,null,null,null,null,null,null,null,null,null,""]
[null,null,null,null,null,null,null,null,null,null,null,""]
[null,null,null,null,null,null,null,null,null,null,null,""]
[null,null,null,null,null,null,null,null,null,null,null,""]
[null,null,null,null,null,null,null,null,null,null,null,""]
[null,null,null,null,null,null,null,null,null,null,null,""]
[null,null,null,null,null,null,null,null,null,null,null,""]
[null,null,null,null,null,null,null,null,null,null,null,""]
[null,null,null,null,null,null,null,null,null,null,null,""]
[null,null,null,null,null,null,null,null,null,null,null,""]
[null,null,null,null,null,null,null,null,null,null,null,""]
[null,null,null,null,null,null,null,null,null,null,null,""]
[null,null,null,null,null,null,null,null,null,null,null,""]
[null,null,null,null,null,null,null,null,null,null,null,""]
[null,null,null,null,null,null,null,null,null,null,null,""]
[null,null,null,null,null,null,null,null,null,null,null,""]
[null,null,null,null,null,null,null,null,null,null,null,""]
[null,null,null,null,null,null,null,null,null,null,null,{"$f":"LEFT(E80,12)","v":""}]
[null,null,null,null,null,null,null,null,null,null,null,""]
[null,null,null,null,null,null,null,null,null,null,null,""]
[null,null,null,null,null,null,null,null,null,null,null,""]
[null,null,null,null,null,null,null,null,null,null,null,""]
[null,null,null,null,null,null,null,null,null,null,null,""]
[null,null,null,null,null,null,null,null,null,null,null,""]
[null,null,null,null,null,null,null,null,null,null,null,""]
[null,null,null,null,null,null,null,null,null,null,null,""]
[null,null,null,null,null,null,null,null,null,null,null,""]
[null,null,null,null,null,null,null,null,null,null,null,""]
[null,null,null,null,null,null,null,null,null,null,null,""]
[null,null,null,null,null,null,null,null,null,null,null,""]
[null,null,null,null,null,null,null,null,null,null,null,""]
[null,null,null,null,null,null,null,null,null,null,null,""]
[null,null,null,null,null,null,null,null,null,null,null,""]
[null,null,null,null,null,null,null,null,null,null,null,""]
[null,null,null,null,null,null,null,null,null,null,null,""]
[null,null,null,null,null,null,null,null,null,null,null,""]
[null,null,null,null,null,null,null,null,null,null,null,""]
[null,null,null,null,null,null,null,null,null,null,null,""]
[null,null,null,null,null,null,null,null,null,null,null,""]
[null,null,null,null,null,null,null,null,null,null,null,""]
[null,null,null,null,null,null,null,null,null,null,null,""]
[null,null,null,null,null,null,null,null,null,null,null,""]
[null,null,null,null,null,null,null,null,null,null,null,""]
[null,null,null,null,null,null,null,null,null,null,null,""]
[null,null,null,null,null,null,null,null,null,null,null,""]
[null,null,null,null,null,null,null,null,null,null,null,""]
[null,null,null,null,null,null,null,null,null,null,null,""]
[null,null,null,null,null,null,null,null,null,null,null,""]
[null,null,null,null,null,null,null,null,null,null,null,""]
[null,null,null,null,null,null,null,null,null,null,null,""]
[null,null,null,null,null,null,null,null,null,null,null,""]
[null,null,null,null,null,null,null,null,null,null,null,""]
[null,null,null,null,null,null,null,null,null,null,null,""]
[null,null,null,null,null,null,null,null,null,null,null,""]
[null,null,null,null,null,null,null,null,null,null,null,""]
[null,null,null,null,null,null,null,null,null,null,null,""]
[null,null,null,null,null,null,null,null,null,null,null,""]
[null,null,null,null,null,null,null,null,null,null,null,""]
{"$rows_left_out":504}
{"sheet":"Таблица характеристик моделей","index":1,"n_rows":38,"n_cols":9,"rows_kept":38,"cut":false,"hidden":true,"merged":[]}
[]
["Номинальный ток двигателя, А","Модель (артикул)","Наименование","Тип питания","Номинальная мощность двигателя, кВт","Номинальный ток двигателя, А","Ссылки",null,"Модель (артикул)"]
[2.5,"V2000-S0P40G","Преобразователь частоты, 1ф. питание 220В, выходная мощность 0,4 кВт, встроенный тормозной прерыватель и ЭМС фильтр","1-ф, 220В, 50/60 гц",0.4,2.5,"https://www.dkc.ru/ru/catalog/1897/V2000-S0P40G/",{"$f":"D3&E3&F3","v":"1-ф, 220В, 50/60 гц0,42,5"},"V2000-S0P40G"]
[4,"V2000-S0P75G","Преобразователь частоты, 1ф. питание 220В, выходная мощность 0,75 кВт, встроенный тормозной прерыватель и ЭМС фильтр","1-ф, 220В, 50/60 гц",0.75,4,"https://www.dkc.ru/ru/catalog/1897/V2000-S0P75G/","1-ф, 220В, 50/60 гц0,754","V2000-S0P75G"]
[2.2999999999999998,"V2000-T0P75G","Преобразователь частоты, 3ф. питание 380В, выходная мощность 0,75 кВт, встроенный тормозной прерыватель и ЭМС фильтр","3-ф, 380В, 50/60 гц",0.75,2.2999999999999998,"https://www.dkc.ru/ru/catalog/1897/V2000-T0P75G/","3-ф, 380В, 50/60 гц0,752,3","V2000-T0P75G"]
[7.5,"V2000-S01P5G","Преобразователь частоты, 1ф. питание 220В, выходная мощность 1,5 кВт, встроенный тормозной прерыватель и ЭМС фильтр","1-ф, 220В, 50/60 гц",1.5,7.5,"https://www.dkc.ru/ru/catalog/1897/V2000-S01P5G/","1-ф, 220В, 50/60 гц1,57,5","V2000-S01P5G"]
[3.7,"V2000-T01P5G","Преобразователь частоты, 3ф. питание 380В, выходная мощность 1,5 кВт, встроенный тормозной прерыватель и ЭМС фильтр","3-ф, 380В, 50/60 гц",1.5,3.7,"https://www.dkc.ru/ru/catalog/1897/V2000-T01P5G/","3-ф, 380В, 50/60 гц1,53,7","V2000-T01P5G"]
[10,"V2000-S02P2G","Преобразователь частоты, 1ф. питание 220В, выходная мощность 2,2 кВт, встроенный тормозной прерыватель и ЭМС фильтр","1-ф, 220В, 50/60 гц",2.2000000000000002,10,"https://www.dkc.ru/ru/catalog/1897/V2000-S02P2G/","1-ф, 220В, 50/60 гц2,210","V2000-S02P2G"]
[5.5,"V2000-T02P2G","Преобразователь частоты, 3ф. питание 380В, выходная мощность 2,2 кВт, встроенный тормозной прерыватель и ЭМС фильтр","3-ф, 380В, 50/60 гц",2.2000000000000002,5.5,"https://www.dkc.ru/ru/catalog/1897/V2000-T02P2G/","3-ф, 380В, 50/60 гц2,25,5","V2000-T02P2G"]
[8.8000000000000007,"V2000-T03P7G","Преобразователь частоты, 3ф. питание 380В, выходная мощность 3,7 кВт, встроенный тормозной прерыватель и ЭМС фильтр","3-ф, 380В, 50/60 гц",3.7,8.8000000000000007,"https://www.dkc.ru/ru/catalog/1897/V2000-T03P7G/","3-ф, 380В, 50/60 гц3,78,8","V2000-T03P7G"]
[13,"V2000-T05P5G","Преобразователь частоты, 3ф. питание 380В, выходная мощность 5,5 кВт, встроенный тормозной прерыватель и ЭМС фильтр","3-ф, 380В, 50/60 гц",5.5,13,"https://www.dkc.ru/ru/catalog/1897/V2000-T05P5G/","3-ф, 380В, 50/60 гц5,513","V2000-T05P5G"]
[17,"V2000-T07P5G","Преобразователь частоты, 3ф. питание 380В, выходная мощность 7,5 кВт, встроенный тормозной прерыватель и ЭМС фильтр","3-ф, 380В, 50/60 гц",7.5,17,"https://www.dkc.ru/ru/catalog/1897/V2000-T07P5G/","3-ф, 380В, 50/60 гц7,517","V2000-T07P5G"]
[25,"V2000-T0011G","Преобразователь частоты, 3ф. питание 380В, выходная мощность 11 кВт, встроенный тормозной прерыватель и ЭМС фильтр","3-ф, 380В, 50/60 гц",11,25,"https://www.dkc.ru/ru/catalog/1897/V2000-T0011G/","3-ф, 380В, 50/60 гц1125","V2000-T0011G"]
[32,"V2000-T0015G","Преобразователь частоты, 3ф. питание 380В, выходная мощность 15 кВт, встроенный тормозной прерыватель и ЭМС фильтр","3-ф, 380В, 50/60 гц",15,32,"https://www.dkc.ru/ru/catalog/1897/V2000-T0015G/","3-ф, 380В, 50/60 гц1532","V2000-T0015G"]
[37,"V2000-T0018G","Преобразователь частоты, 3ф. питание 380В, выходная мощность 18,5 кВт, встроенный тормозной прерыватель и ЭМС фильтр","3-ф, 380В, 50/60 гц",18.5,37,"https://www.dkc.ru/ru/catalog/1897/V2000-T0018G/","3-ф, 380В, 50/60 гц18,537","V2000-T0018G"]
[45,"V2000-T0022G","Преобразователь частоты, 3ф. питание 380В, выходная мощность 22 кВт, встроенный тормозной прерыватель и ЭМС фильтр","3-ф, 380В, 50/60 гц",22,45,"https://www.dkc.ru/ru/catalog/1897/V2000-T0022G/","3-ф, 380В, 50/60 гц2245","V2000-T0022G"]
[60,"V2000-T0030G","Преобразователь частоты, 3ф. питание 380В, выходная мощность 30 кВт, встроенный тормозной прерыватель","3-ф, 380В, 50/60 гц",30,60,"https://www.dkc.ru/ru/catalog/1897/V2000-T0030G/","3-ф, 380В, 50/60 гц3060","V2000-T0030G"]
[75,"V2000-T0037G","Преобразователь частоты, 3ф. питание 380В, выходная мощность 37 кВт, встроенный тормозной прерыватель","3-ф, 380В, 50/60 гц",37,75,"https://www.dkc.ru/ru/catalog/1897/V2000-T0037G/","3-ф, 380В, 50/60 гц3775","V2000-T0037G"]
[90,"V2000-T0045G","Преобразователь частоты, 3ф. питание 380В, выходная мощность 45 кВт, встроенный тормозной прерыватель","3-ф, 380В, 50/60 гц",45,90,"https://www.dkc.ru/ru/catalog/1897/V2000-T0045G/","3-ф, 380В, 50/60 гц4590","V2000-T0045G"]
[110,"V2000-T0055G","Преобразователь частоты, 3ф. питание 380В, выходная мощность 55 кВт","3-ф, 380В, 50/60 гц",55,110,"https://www.dkc.ru/ru/catalog/1897/V2000-T0055G/","3-ф, 380В, 50/60 гц55110","V2000-T0055G"]
[152,"V2000-T0075G","Преобразователь частоты, 3ф. питание 380В, выходная мощность 75 кВт","3-ф, 380В, 50/60 гц",75,152,"https://www.dkc.ru/ru/catalog/1897/V2000-T0075G/","3-ф, 380В, 50/60 гц75152","V2000-T0075G"]
[176,"V2000-T0090G","Преобразователь частоты, 3ф. питание 380В, выходная мощность 90 кВт","3-ф, 380В, 50/60 гц",90,176,"https://www.dkc.ru/ru/catalog/1897/V2000-T0090G/","3-ф, 380В, 50/60 гц90176","V2000-T0090G"]
[210,"V2000-T0110G","Преобразователь частоты, 3ф. питание 380В, выходная мощность 110 кВт","3-ф, 380В, 50/60 гц",110,210,"https://www.dkc.ru/ru/catalog/1897/V2000-T0110G/","3-ф, 380В, 50/60 гц110210","V2000-T0110G"]
[252,"V2000-T0132G","Преобразователь частоты, 3ф. питание 380В, выходная мощность 132 кВт","3-ф, 380В, 50/60 гц",132,252,"https://www.dkc.ru/ru/catalog/1897/V2000-T0132G/","3-ф, 380В, 50/60 гц132252","V2000-T0132G"]
[304,"V2000-T0160G","Преобразователь частоты, 3ф. питание 380В, выходная мощность 160 кВт","3-ф, 380В, 50/60 гц",160,304,"https://www.dkc.ru/ru/catalog/1897/V2000-T0160G/","3-ф, 380В, 50/60 гц160304","V2000-T0160G"]
[350,"V2000-T0185G","Преобразователь частоты, 3ф. питание 380В, выходная мощность 185 кВт","3-ф, 380В, 50/60 гц",185,350,"https://www.dkc.ru/ru/catalog/1897/V2000-T0185G/","3-ф, 380В, 50/60 гц185350","V2000-T0185G"]
[380,"V2000-T0200G","Преобразователь частоты, 3ф. питание 380В, выходная мощность 200 кВт","3-ф, 380В, 50/60 гц",200,380,"https://www.dkc.ru/ru/catalog/1897/V2000-T0200G/","3-ф, 380В, 50/60 гц200380","V2000-T0200G"]
[426,"V2000-T0220G","Преобразователь частоты, 3ф. питание 380В, выходная мощность 220 кВт","3-ф, 380В, 50/60 гц",220,426,"https://www.dkc.ru/ru/catalog/1897/V2000-T0220G/","3-ф, 380В, 50/60 гц220426","V2000-T0220G"]
[470,"V2000-T0250G","Преобразователь частоты, 3ф. питание 380В, выходная мощность 250 кВт","3-ф, 380В, 50/60 гц",250,470,"https://www.dkc.ru/ru/catalog/1897/V2000-T0250G/","3-ф, 380В, 50/60 гц250470","V2000-T0250G"]
[520,"V2000-T0280G","Преобразователь частоты, 3ф. питание 380В, выходная мощность 280 кВт","3-ф, 380В, 50/60 гц",280,520,"https://www.dkc.ru/ru/catalog/1897/V2000-T0280G/","3-ф, 380В, 50/60 гц280520","V2000-T0280G"]
[600,"V2000-T0315G","Преобразователь частоты, 3ф. питание 380В, выходная мощность 315 кВт","3-ф, 380В, 50/60 гц",315,600,"https://www.dkc.ru/ru/catalog/1897/V2000-T0315G/","3-ф, 380В, 50/60 гц315600","V2000-T0315G"]
[665,"V2000-T0355G","Преобразователь частоты, 3ф. питание 380В, выходная мощность 355 кВт","3-ф, 380В, 50/60 гц",355,665,"https://www.dkc.ru/ru/catalog/1897/V2000-T0355G/","3-ф, 380В, 50/60 гц355665","V2000-T0355G"]
[725,"V2000-T0400G","Преобразователь частоты, 3ф. питание 380В, выходная мощность 400 кВт","3-ф, 380В, 50/60 гц",400,725,"https://www.dkc.ru/ru/catalog/1897/V2000-T0400G/","3-ф, 380В, 50/60 гц400725","V2000-T0400G"]
[820,"V2000-T0450G","Преобразователь частоты, 3ф. питание 380В, выходная мощность 450 кВт","3-ф, 380В, 50/60 гц",450,820,"https://www.dkc.ru/ru/catalog/1897/V2000-T0450G/","3-ф, 380В, 50/60 гц450820","V2000-T0450G"]
[950,"V2000-T0500G","Преобразователь частоты, 3ф. питание 380В, выходная мощность 500 кВт","3-ф, 380В, 50/60 гц",500,950,"https://www.dkc.ru/ru/catalog/1897/V2000-T0500G/","3-ф, 380В, 50/60 гц500950","V2000-T0500G"]
[null,"V2000-UVWPG","Плата расширения для подключения энкодера дифференциального типа",null,null,null,"https://www.dkc.ru/ru/catalog/1897/V2000-UVWPG/",""]
[null,"V2000-TRAY","Монтажная рамка для установки съемной панели локального управления преобразователя частоты на дверь шкафа",null,null,null,"https://www.dkc.ru/ru/catalog/1897/V2000-TRAY/",""]
[null,"H1000-VFDHMI","Съемная панель локального управления для преобразователя частоты с потенциометром",null,null,null,"https://www.dkc.ru/ru/catalog/1897/H1000-VFDHMI/",""]

{"sheet":"Списки","index":2,"n_rows":34,"n_cols":7,"rows_kept":34,"cut":false,"hidden":true,"merged":[]}
["Номинальная мощность двигателя, кВт",null,"Тип питания",null,"Номинальный ток двигателя, А",null,"4. Выводить аксессуары"]
[0.4,null,"1-ф, 220В, 50/60 гц",null,2.2999999999999998,null,"Да"]
[0.75,null,"3-ф, 380В, 50/60 гц",null,2.5,null,"Нет"]
[1.5,null,null,null,3.7]
[2.2000000000000002,null,null,null,4]
[3.7,null,null,null,5.5]
[5.5,null,null,null,7.5]
[7.5,null,null,null,8.8000000000000007]
[11,null,null,null,10]
[15,null,null,null,13]
[18.5,null,null,null,17]
[22,null,null,null,25]
[30,null,null,null,32]
[37,null,null,null,37]
[45,null,null,null,45]
[55,null,null,null,60]
[75,null,null,null,75]
[90,null,null,null,90]
[110,null,null,null,110]
[132,null,null,null,152]
[160,null,null,null,176]
[185,null,null,null,210]
[200,null,null,null,252]
[220,null,null,null,304]
[250,null,null,null,350]
[280,null,null,null,380]
[315,null,null,null,426]
[355,null,null,null,470]
[400,null,null,null,520]
[450,null,null,null,600]
[500,null,null,null,665]
[null,null,null,null,725]
[null,null,null,null,820]
[null,null,null,null,950]

{"sheet":"Лист1","index":3,"n_rows":23,"n_cols":5,"rows_kept":23,"cut":false,"hidden":true,"merged":[[1,1,1,4],[2,1,2,4],[4,1,4,4],[14,0,14,1]]}
[{"$f":"COUNTIF(Конфигуратор!L:L,\"Спецификация\")","v":2},"№ позиции","Артикул","Наименование","Ссылка"]
[{"$f":"MAX(Конфигуратор!E:E)","v":2},{"$f":"IF(C4=\"Не выбран\",0,\"Спецификация \"&A1+1)","v":"Спецификация 3"}]
[null,{"$f":"IF(C4=\"Не выбран\",0,\"Преобразователь частоты серии V2000 Mitra\")","v":"Преобразователь частоты серии V2000 Mitra"}]
[null,{"$f":"IF(C4=\"Не выбран\",0,A2+1)","v":3},{"$f":"IFERROR(VLOOKUP(Конфигуратор!B17&Конфигуратор!B19&Конфигуратор!B21,'Таблица характеристик моделей'!H3:I35,2,0),\"Не выбран\")","v":"V2000-T0P75G"},{"$f":"IFERROR(VLOOKUP($C$4,'Таблица характеристик моделей'!$B:$G,2,0),\"По указанным параметрам преобразователь не выбран, скорректирцуйте параметры выбора\")","v":"Преобразователь частоты, 3ф. питание 380В, выходная мощность 0,75 кВт, встроенный тормозной прерыватель и ЭМС фильтр"},{"$f":"IFERROR(VLOOKUP($C$4,'Таблица характеристик моделей'!$B:$G,6,0),\"\")","v":"https://www.dkc.ru/ru/catalog/1897/V2000-T0P75G/"}]
[null,{"$f":"IF(Конфигуратор!$B$23 =\"Да\",\"Аксессуары\", 0)","v":0}]
[null,{"$f":"IF(B5=0,0,B4+1)","v":0},{"$f":"'Таблица характеристик моделей'!B36","v":"V2000-UVWPG"},{"$f":"VLOOKUP($C$6,'Таблица характеристик моделей'!$B:$G,2,0)","v":"Плата расширения для подключения энкодера дифференциального типа"},{"$f":"VLOOKUP($C$6,'Таблица характеристик моделей'!$B:$G,6,0)","v":"https://www.dkc.ru/ru/catalog/1897/V2000-UVWPG/"}]
[null,{"$f":"IF(B6=0,0,B6+1)","v":0},{"$f":"'Таблица характеристик моделей'!B37","v":"V2000-TRAY"},{"$f":"VLOOKUP($C$7,'Таблица характеристик моделей'!$B:$G,2,0)","v":"Монтажная рамка для установки съемной панели локального управления преобразователя частоты на дверь шкафа"},{"$f":"VLOOKUP($C$7,'Таблица характеристик моделей'!$B:$G,6,0)","v":"https://www.dkc.ru/ru/catalog/1897/V2000-TRAY/"}]
[null,{"$f":"IF(B7=0,0,B7+1)","v":0},{"$f":"'Таблица характеристик моделей'!B38","v":"H1000-VFDHMI"},{"$f":"VLOOKUP($C$8,'Таблица характеристик моделей'!$B:$G,2,0)","v":"Съемная панель локального управления для преобразователя частоты с потенциометром"},{"$f":"VLOOKUP($C$8,'Таблица характеристик моделей'!$B:$G,6,0)","v":"https://www.dkc.ru/ru/catalog/1897/H1000-VFDHMI/"}]
[]
[]
[]
[]
[]
[]
["Выбор параметров"]
[]
["1. Тип питания"]
[]
["2. Номинальная мощность двигателя, кВт"]
[]
["3. Номинальный ток двигателя, А",{"$f":"IF(Конфигуратор!$B$19=\"\",\"\",IF(Конфигуратор!$B$19=0.4,2.5,IF(Конфигуратор!$B$19=0.75,IF(Конфигуратор!$B$17=\"1-ф, 220В, 50/60 гц\",4,2.3),IF(Конфигуратор!$B$19=1.5,IF(Конфигуратор!$B$17=\"1-ф, 220В, 50/60 гц\",7.5,3.7),IF(Конфигуратор!$B$19=2.2,IF(Конфигуратор!$B$17=\"1-ф, 220В, 50/60 гц\",10,5.5),IF(Конфигуратор!$B$17=\"\",\"\",VLOOKUP(Конфигуратор!$B$19,'Таблица характеристик моделей'!E10:F35,2,0)))))))","v":2.2999999999999998}]
[]
["4. Выводить аксессуары",{"$f":"IF(Конфигуратор!$B$17=\"\",\"\",\"Нет\")","v":"Нет"}]