{"text_format":"1","workbook":"xlsx","n_sheets":4,"sheets":["Конфигуратор","Лист1","Наименование","Списки"],"not_rendered":{"charts":0,"images":2,"macros":1,"external_links":0,"defined_names":4,"comments":0,"pivot_tables":0},"unopened":[],"bounds":{"document_bytes":16777216,"sheet_cells":100000,"rows_first":2000,"rows_last":500,"rows_between":2000,"halvings":0,"cell_chars":16384,"cell_head_chars":4096},"cells_cut":0,"cells_raw":0,"read":"whole","date_system":"1900"}

{"sheet":"Конфигуратор","index":0,"n_rows":1008,"n_cols":12,"rows_kept":1008,"cut":false,"hidden":false,"merged":[[28,4,28,7],[5,4,9,8],[4,4,4,8],[15,4,15,7],[16,4,16,7],[22,4,22,7],[67,0,67,1],[40,0,40,1],[14,0,14,1],[15,0,15,1],[4,0,4,2],[5,0,9,2]]}
[]
[]
[]
[]
["Конфигуратор Светосигнальной арматуры Mitra",null,null,null,"Спецификация"]
["Данный конфигуратор предназначен для подбора компонентов, необходимых для комплектации законченного устройства свтосигнальной арматуры Mitra.\nИнструкция:\n1. Выберите тип устройсва, который вы хотите собрать.\n2. Выберите его характеристики.",null,null,null,"Результат:\nВ разделе Спецификация указаны комплектующие, необходимые для сборки кнопки, переключателя или сигнального индикатора.\n\nНеобходимо подбирать компоненты, только из предложенных вариантов. Старая светосигнальная арматура M22 несовместима с новой."]
[null,null,null,null,null,null,null,null,null,{"$f":"\"\"","v":""}]
[]
[]
[]
[]
[]
[]
[null,null,null,null,null,null,null,null,{"$f":"IFERROR(HYPERLINK(VLOOKUP($F14,Наименование!A:O,15,0),VLOOKUP($F14,Наименование!A:O,15,0)),\"\")","v":""},null,null,"Содержимое заголовка"]
["Выбор параметров",null,null,null,"№ позиции","Артикул","Наименование","Количество","Ссылка",null,null,{"$f":"LEFT(E15,12)","v":"№ позиции"}]
["Кнопка",null,null,null,"Спецификация 1",null,null,null,{"$f":"IFERROR(HYPERLINK(VLOOKUP($F16,Наименование!A:O,15,0),VLOOKUP($F16,Наименование!A:O,15,0)),\"\")","v":""},null,null,{"$f":"LEFT(E16,12)","v":"Спецификация"}]
[null,null,null,null,"Кнопка",null,null,null,{"$f":"IFERROR(HYPERLINK(VLOOKUP($F17,Наименование!A:O,15,0),VLOOKUP($F17,Наименование!A:O,15,0)),\"\")","v":""},null,null,"Кнопка"]
["1. Вид кнопки:","Плоская",{"$f":"IF(B18=\"\",\"Выберите вид кнопки\",\"\")","v":""},null,1,"M22P-FMLWA","Головка кнопки плоская прозрачная без фиксации, белая, алюминий",1,{"$f":"IFERROR(HYPERLINK(VLOOKUP($F18,Наименование!A:O,15,0),VLOOKUP($F18,Наименование!A:O,15,0)),\"\")","v":"https://www.dkc.ru/ru/catalog/2028/M22P-FMLWA/"},null,null,"1"]
[null,null,null,null,2,"M22MF","Монтажное основание для крепления головок кнопок, переключателей и контактных блоков",1,{"$f":"IFERROR(HYPERLINK(VLOOKUP($F19,Наименование!A:O,15,0),VLOOKUP($F19,Наименование!A:O,15,0)),\"\")","v":"https://www.dkc.ru/ru/catalog/2028/M22MF/"},null,null,"2"]
["2. С возможностью подсветки","Да",{"$f":"IF(B18=\"Грибовидная\",IF(B20=\"\",\"Грибовидная кнопка с подсветкой 'Да'\",IF(B20=\"Да\",\"\",\"Выберите возможность подсветки  'Да'\")),IF(B20&B24=\"ДаЧёрный\",\"Чёрная кнопка без подсветки\",IF(B20=\"\",\"Выберите возможность подсветки\",\"\")))","v":""},null,3,"MC-L24WPS","Контактный блок с клеммными зажимами под винт со светодиодом на  9-24В, белый",1,{"$f":"IFERROR(HYPERLINK(VLOOKUP($F20,Наименование!A:O,15,0),VLOOKUP($F20,Наименование!A:O,15,0)),\"\")","v":"https://www.dkc.ru/ru/catalog/2028/MC-L24WPS/"},null,null,"3"]
[null,null,null,null,4,"MC-NOPS","Контактный блок с клеммными зажимами под винт, нормально-открытый",3,{"$f":"IFERROR(HYPERLINK(VLOOKUP($F21,Наименование!A:O,15,0),VLOOKUP($F21,Наименование!A:O,15,0)),\"\")","v":"https://www.dkc.ru/ru/catalog/2028/MC-NOPS/"},null,null,"4"]
["3. Механизм:","Без фиксации",{"$f":"IF(B18=\"Грибовидная\",IF(B22=\"Без фиксации\",\"Выберите механизм кнопки 'С фиксацией'\",IF(B22=\"\",\"Грибовидная кнопка 'С фиксацией'\",\"\")),IF(B22=\"\",IF(B20=\"Нет\",\"Кнопка без подсветки только 'Без фиксации'\",\"Выберите механизм кнопки\"),\"\"))","v":""},null,"",null,null,null,{"$f":"IFERROR(HYPERLINK(VLOOKUP($F22,Наименование!A:O,15,0),VLOOKUP($F22,Наименование!A:O,15,0)),\"\")","v":""},null,null,""]
[null,null,null,null,"Переключатель",null,null,null,{"$f":"IFERROR(HYPERLINK(VLOOKUP($F23,Наименование!A:O,15,0),VLOOKUP($F23,Наименование!A:O,15,0)),\"\")","v":""},null,null,"Переключател"]
["4. Цвет","Белый",{"$f":"IF(B18=\"Грибовидная\",IF(B24=\"Красный\",\"\",IF(B24=\"\",\"Грибовидная кнопка 'Красная'\",\"Выберите цвет 'Красный'\")),IF(B24=\"\",\"Выберите цвет кнопки\",IF(B20&B24=\"ДаЧёрный\",\"Чёрная кнопка без подсветки\",\"\")))","v":""},null,1,"M22S-L3P","Головака переключателя на 3 положения с фиксацией стандартная ручка, черный",1,{"$f":"IFERROR(HYPERLINK(VLOOKUP($F24,Наименование!A:O,15,0),VLOOKUP($F24,Наименование!A:O,15,0)),\"\")","v":"https://www.dkc.ru/ru/catalog/2028/M22S-L3P/"},null,null,"1"]
[null,null,null,null,2,"M22MF","Монтажное основание для крепления головок кнопок, переключателей и контактных блоков",1,{"$f":"IFERROR(HYPERLINK(VLOOKUP($F25,Наименование!A:O,15,0),VLOOKUP($F25,Наименование!A:O,15,0)),\"\")","v":"https://www.dkc.ru/ru/catalog/2028/M22MF/"},null,null,"2"]
["5. Материал кольца","Алюминий",{"$f":"IF(B26=\"\",\"Выберите материал кольца\",\"\")","v":""},null,3,"MC-L220RPP","Контактный  блок с клеммным безвинтовым зажимом со светодиодом на 220В, красный",1,{"$f":"IFERROR(HYPERLINK(VLOOKUP($F26,Наименование!A:O,15,0),VLOOKUP($F26,Наименование!A:O,15,0)),\"\")","v":"https://www.dkc.ru/ru/catalog/2028/MC-L220RPP/"},null,null,"3"]
[null,null,null,null,4,"MC-NOPP","Контактный блок с клеммным безвинтовым  зажимом, нормально-открытый",1,{"$f":"IFERROR(HYPERLINK(VLOOKUP($F27,Наименование!A:O,15,0),VLOOKUP($F27,Наименование!A:O,15,0)),\"\")","v":"https://www.dkc.ru/ru/catalog/2028/MC-NOPP/"},null,null,"4"]
["6. Тип зажима контактного блока","Винтовой",{"$f":"IF(B28=\"\",\"Выберите тип зажима\",\"\")","v":""},null,"",null,null,null,{"$f":"IFERROR(HYPERLINK(VLOOKUP($F28,Наименование!A:O,15,0),VLOOKUP($F28,Наименование!A:O,15,0)),\"\")","v":""},null,null,""]
[null,null,null,null,"Сигнальный индикатор",null,null,null,{"$f":"IFERROR(HYPERLINK(VLOOKUP($F29,Наименование!A:O,15,0),VLOOKUP($F29,Наименование!A:O,15,0)),\"\")","v":""},null,null,"Сигнальный и"]
["7. Наличие NO контактов","Да",{"$f":"IF(B30=\"\",\"Выберите наличие NO контактов\",IF(B30=\"Нет\",IF(B34=\"Нет\",\"Необходимо выбрать блоки с 'NO или NC контактами'\",\"\"),\"\"))","v":""},null,1,"M22L-F220RAP","Сигнальная лампа со встроенным диодом 220В, красная, алюминиевое кольцо, зажим Plug-In",1,{"$f":"IFERROR(HYPERLINK(VLOOKUP($F30,Наименование!A:O,15,0),VLOOKUP($F30,Наименование!A:O,15,0)),\"\")","v":"https://www.dkc.ru/ru/catalog/2028/M22L-F220RAP/"},null,null,"1"]
{"$rows_left_out":979}
{"sheet":"Лист1","index":1,"n_rows":42,"n_cols":10,"rows_kept":42,"cut":false,"hidden":true,"merged":[[2,1,2,4],[9,1,9,4],[16,1,16,4],[1,1,1,4],[6,6,6,8]]}
[{"$f":"COUNTIF(Конфигуратор!L:L,\"Спецификация\")","v":1},"№ позиции","Артикул","Наименование","Количество","Ссылка"]
["Индекс",{"$f":"IF(SUM(B4:B18)=0,0,\"Спецификация \"&A1+1)","v":"Спецификация 2"}]
[{"$f":"IF(OR(C4=\"\",C4=\"Ошибка параметров ввода\",C5=\"Ошибка параметров ввода\",C6=\"Ошибка параметров ввода\",C7=\"Ошибка параметров ввода\",C8=\"Ошибка параметров ввода\"),0,1)","v":1},{"$f":"IF(SUM(A3:A7)=0,,\"Кнопка\")","v":"Кнопка"}]
[{"$f":"IF(OR(C5=\"\",C4=\"Ошибка параметров ввода\",C5=\"Ошибка параметров ввода\",C6=\"Ошибка параметров ввода\",C7=\"Ошибка параметров ввода\",C8=\"Ошибка параметров ввода\"),0,1)","v":1},{"$f":"IF(A3=1,A3,)","v":1},{"$f":"IFERROR(VLOOKUP(Конфигуратор!$B$18&Конфигуратор!$B$22&Конфигуратор!$B$24&Конфигуратор!$B$26&Конфигуратор!$B$20,Наименование!$M:$N,2,0),\"Ошибка параметров ввода\")","v":"M22P-FMLWA"},{"$f":"IFERROR(VLOOKUP(C4,Наименование!$A:$B,2,0),\"\")","v":"Головка кнопки плоская прозрачная без фиксации, белая, алюминий"},{"$f":"IF(C4=\"\",\"\",1)","v":1},{"$f":"HYPERLINK(VLOOKUP($C$4,Наименование!A:O,15,0),VLOOKUP($C$4,Наименование!A:O,15,0))","v":"https://www.dkc.ru/ru/catalog/2028/M22P-FMLWA/"}]
[{"$f":"IF(OR(C6=\"\",C4=\"Ошибка параметров ввода\",C5=\"Ошибка параметров ввода\",C6=\"Ошибка параметров ввода\",C7=\"Ошибка параметров ввода\",C8=\"Ошибка параметров ввода\"),0,1)","v":1},{"$f":"IF(A4>0,A4+B4,)","v":2},{"$f":"IF(C4=\"Ошибка параметров ввода\",\"\",\"M22MF\")","v":"M22MF"},{"$f":"IFERROR(VLOOKUP(C5,Наименование!$A:$B,2,0),\"\")","v":"Монтажное основание для крепления головок кнопок, переключателей и контактных блоков"},{"$f":"IF(C5=\"\",\"\",1)","v":1},{"$f":"HYPERLINK(VLOOKUP($C$5,Наименование!A:O,15,0),VLOOKUP($C$5,Наименование!A:O,15,0))","v":"https://www.dkc.ru/ru/catalog/2028/M22MF/"}]
[{"$f":"IF(OR(C7=\"\",C4=\"Ошибка параметров ввода\",C5=\"Ошибка параметров ввода\",C6=\"Ошибка параметров ввода\",C7=\"Ошибка параметров ввода\",C8=\"Ошибка параметров ввода\"),0,1)","v":1},{"$f":"IF(A5>0,A5+A4+A3,)","v":3},{"$f":"IFERROR(IF(Конфигуратор!$B$20=\"\",VLOOKUP(Конфигуратор!$B$24&Конфигуратор!$B$28&\"Нет\"&Конфигуратор!$B$38,Наименование!$M:$N,2,0),VLOOKUP(Конфигуратор!$B$24&Конфигуратор!$B$28&Конфигуратор!$B$20&Конфигуратор!$B$38,Наименование!$M:$N,2,0)),IF(Конфигуратор!$B$20=\"Да\",\"Ошибка параметров ввода\",\"\"))","v":"MC-L24WPS"},{"$f":"IFERROR(VLOOKUP(C6,Наименование!$A:$B,2,0),\"\")","v":"Контактный блок с клеммными зажимами под винт со светодиодом на  9-24В, белый"},{"$f":"IF(C6=\"\",\"\",1)","v":1},{"$f":"HYPERLINK(VLOOKUP($C$6,Наименование!A:O,15,0),VLOOKUP($C$6,Наименование!A:O,15,0))","v":"https://www.dkc.ru/ru/catalog/2028/MC-L24WPS/"}]
[{"$f":"IF(OR(C8=\"\",C4=\"Ошибка параметров ввода\",C5=\"Ошибка параметров ввода\",C6=\"Ошибка параметров ввода\",C7=\"Ошибка параметров ввода\",C8=\"Ошибка параметров ввода\"),0,1)","v":0},{"$f":"IF(A6>0,A6+A5+A4+A3,)","v":4},{"$f":"IF(Конфигуратор!$B$30=\"Да\",IF(Лист1!E7=0,\"Ошибка параметров ввода\",IFERROR(VLOOKUP(Конфигуратор!$B$28&Конфигуратор!$B$30&\"Нет\",Наименование!$M:$N,2,0),\"\")),IF(Конфигуратор!$B$34=\"Нет\",\"Ошибка параметров ввода\",\"\"))","v":"MC-NOPS"},{"$f":"IFERROR(VLOOKUP(C7,Наименование!$A:$B,2,0),\"\")","v":"Контактный блок с клеммными зажимами под винт, нормально-открытый"},{"$f":"Конфигуратор!$B$32","v":3},{"$f":"HYPERLINK(VLOOKUP($C$7,Наименование!A:O,15,0),VLOOKUP($C$7,Наименование!A:O,15,0))","v":"https://www.dkc.ru/ru/catalog/2028/MC-NOPS/"},"Пустая ячейка для заполнения",null,null," "]
[null,{"$f":"IF(A7>0,A7+A6+A5+A3+A4,)","v":0},{"$f":"IF(Конфигуратор!$B$34=\"Да\",IF(Лист1!E8=0,\"Ошибка параметров ввода\",IFERROR(VLOOKUP(Конфигуратор!$B$28&\"Нет\"&Конфигуратор!$B$34,Наименование!$M:$N,2,0),\"\")),IF(Конфигуратор!$B$30=\"Нет\",\"Ошибка параметров ввода\",\"\"))","v":""},{"$f":"IFERROR(VLOOKUP(C8,Наименование!$A:$B,2,0),\"\")","v":""},{"$f":"Конфигуратор!$B$36","v":0},{"$f":"HYPERLINK(VLOOKUP($C$8,Наименование!A:O,15,0),VLOOKUP($C$8,Наименование!A:O,15,0))","v":{"$error":"#N/A"}}]
[null,{"$f":"IF(B3=0,0,\"\")","v":""}]
[{"$f":"IF(OR(C11=\"\",C11=\"Ошибка параметров ввода\",C12=\"Ошибка параметров ввода\",C13=\"Ошибка параметров ввода\",C14=\"Ошибка параметров ввода\",C15=\"Ошибка параметров ввода\"),0,1)","v":1},{"$f":"IF(SUM(A10:A14)=0,,\"Переключатель\")","v":"Переключатель"}]
[{"$f":"IF(OR(C12=\"\",C11=\"Ошибка параметров ввода\",C12=\"Ошибка параметров ввода\",C13=\"Ошибка параметров ввода\",C14=\"Ошибка параметров ввода\",C15=\"Ошибка параметров ввода\"),0,1)","v":1},{"$f":"IF(A10=1,A10,)","v":1},{"$f":"IFERROR(VLOOKUP(Конфигуратор!$B$43&Конфигуратор!$B$47&Конфигуратор!$B$49&Конфигуратор!$B$45,Наименование!$M:$N,2,0),\"Ошибка параметров ввода\")","v":"M22S-L3P"},{"$f":"IFERROR(VLOOKUP(C11,Наименование!$A:$B,2,0),\"\")","v":"Головака переключателя на 3 положения с фиксацией стандартная ручка, черный"},{"$f":"IF(C11=\"\",\"\",1)","v":1},{"$f":"HYPERLINK(VLOOKUP($C$11,Наименование!A:O,15,0),VLOOKUP($C$11,Наименование!A:O,15,0))","v":"https://www.dkc.ru/ru/catalog/2028/M22S-L3P/"}]
[{"$f":"IF(OR(C13=\"\",C11=\"Ошибка параметров ввода\",C12=\"Ошибка параметров ввода\",C13=\"Ошибка параметров ввода\",C14=\"Ошибка параметров ввода\",C15=\"Ошибка параметров ввода\"),0,1)","v":1},{"$f":"IF(A11>0,A11+B11,)","v":2},{"$f":"IF(C11=\"Ошибка параметров ввода\",\"\",\"M22MF\")","v":"M22MF"},{"$f":"IFERROR(VLOOKUP(C12,Наименование!$A:$B,2,0),\"\")","v":"Монтажное основание для крепления головок кнопок, переключателей и контактных блоков"},{"$f":"IF(C12=\"\",\"\",1)","v":1},{"$f":"HYPERLINK(VLOOKUP($C$12,Наименование!A:O,15,0),VLOOKUP($C$12,Наименование!A:O,15,0))","v":"https://www.dkc.ru/ru/catalog/2028/M22MF/"}]
[{"$f":"IF(OR(C14=\"\",C11=\"Ошибка параметров ввода\",C12=\"Ошибка параметров ввода\",C13=\"Ошибка параметров ввода\",C14=\"Ошибка параметров ввода\",C15=\"Ошибка параметров ввода\"),0,1)","v":1},{"$f":"IF(A12>0,A12+A11+A10,)","v":3},{"$f":"IFERROR(IF(Конфигуратор!$B$51=\"Да\",VLOOKUP(Конфигуратор!$B$55&Конфигуратор!$B$57&Конфигуратор!$B$51&Конфигуратор!$B$53,Наименование!$M:$N,2,0),\"\"),\"\")","v":"MC-L220RPP"},{"$f":"IFERROR(VLOOKUP(C13,Наименование!$A:$B,2,0),\"\")","v":"Контактный  блок с клеммным безвинтовым зажимом со светодиодом на 220В, красный"},{"$f":"IF(C13=\"\",\"\",1)","v":1},{"$f":"HYPERLINK(VLOOKUP($C$13,Наименование!A:O,15,0),VLOOKUP($C$13,Наименование!A:O,15,0))","v":"https://www.dkc.ru/ru/catalog/2028/MC-L220RPP/"}]
[{"$f":"IF(OR(C15=\"\",C11=\"Ошибка параметров ввода\",C12=\"Ошибка параметров ввода\",C13=\"Ошибка параметров ввода\",C14=\"Ошибка параметров ввода\",C15=\"Ошибка параметров ввода\"),0,1)","v":0},{"$f":"IF(A13>0,A13+A12+A11+A10,)","v":4},{"$f":"IF(Конфигуратор!$B$59=\"Да\",IF(Лист1!E14=0,\"Ошибка параметров ввода\",IFERROR(VLOOKUP(Конфигуратор!$B$57&Конфигуратор!$B$59&\"Нет\",Наименование!$M:$N,2,0),\"\")),IF(Конфигуратор!$B$63=\"Нет\",\"Ошибка параметров ввода\",\"\"))","v":"MC-NOPP"},{"$f":"IFERROR(VLOOKUP(C14,Наименование!$A:$B,2,0),\"\")","v":"Контактный блок с клеммным безвинтовым  зажимом, нормально-открытый"},{"$f":"Конфигуратор!$B$61","v":1},{"$f":"HYPERLINK(VLOOKUP($C$14,Наименование!A:O,15,0),VLOOKUP($C$14,Наименование!A:O,15,0))","v":"https://www.dkc.ru/ru/catalog/2028/MC-NOPP/"}]
[null,{"$f":"IF(A14>0,A14+A13+A12+A10+A11,)","v":0},{"$f":"IF(Конфигуратор!$B$63=\"Да\",IF(Лист1!E15=0,\"Ошибка параметров ввода\",IFERROR(VLOOKUP(Конфигуратор!$B$57&\"Нет\"&Конфигуратор!$B$63,Наименование!$M:$N,2,0),\"\")),IF(Конфигуратор!$B$59=\"Нет\",\"Ошибка параметров ввода\",\"\"))","v":""},{"$f":"IFERROR(VLOOKUP(C15,Наименование!$A:$B,2,0),\"\")","v":""},{"$f":"Конфигуратор!$B$65","v":0},{"$f":"HYPERLINK(VLOOKUP($C$15,Наименование!A:O,15,0),VLOOKUP($C$15,Наименование!A:O,15,0))","v":{"$error":"#N/A"}}]
[null,{"$f":"IF(B10=0,0,\"\")","v":""}]
[{"$f":"IF(C18=\"\",0,1)","v":1},{"$f":"IF(A17=0,,\"Сигнальный индикатор\")","v":"Сигнальный индикатор"}]
[null,{"$f":"IF(A17>0,A17,)","v":1},{"$f":"IFERROR(VLOOKUP(Конфигуратор!$B$70&Конфигуратор!$B$76&Конфигуратор!$B$74&Конфигуратор!$B$72,Наименование!$M:$N,2,0),\"\")","v":"M22L-F220RAP"},{"$f":"IFERROR(VLOOKUP(C18,Наименование!A:B,2,0),\"\")","v":"Сигнальная лампа со встроенным диодом 220В, красная, алюминиевое кольцо, зажим Plug-In"},{"$f":"IF(C18=\"\",\"\",1)","v":1},{"$f":"HYPERLINK(VLOOKUP($C$18,Наименование!A:O,15,0),VLOOKUP($C$18,Наименование!A:O,15,0))","v":"https://www.dkc.ru/ru/catalog/2028/M22L-F220RAP/"}]
[{"$f":"MAX(A3:A18)","v":1},{"$f":"IF(B17=0,0,\"\")","v":""},null,null,null,null,null,"J","B","Правила заполнения"]
[null,null,null,null,null,null,null,20,20,{"$f":"IF(Конфигуратор!$B$18=\"Грибовидная\",\"Да\",IF(Конфигуратор!$B$24=\"Чёрный\",\"Нет\",\"\"))","v":""}]
[]
[null,null,null,null,null,null,null,22,22,{"$f":"IF(Конфигуратор!$B$18=\"Грибовидная\",\"С фиксацией\",\"\")","v":""}]
[]
[null,null,null,null,null,null,null,23,24,{"$f":"IF(Конфигуратор!$B$18=\"Грибовидная\",\"Красный\",\"\")","v":""}]
[]
[null,null,null,null,null,null,null,26,26]
[]
[null,null,null,null,null,null,null,28,32,{"$f":"IF(Конфигуратор!$B$30=\"Нет\",0,\"\")","v":""}]
[]
[null,null,null,null,null,null,null,30,36,{"$f":"IF(Конфигуратор!$B$34=\"Нет\",0,\"\")","v":0}]
{"$rows_left_out":13}
{"sheet":"Наименование","index":2,"n_rows":180,"n_cols":15,"rows_kept":180,"cut":false,"hidden":true,"merged":[]}
["Артикул","Наименование","1.Вид кнопки","8.С возможностью подсветки","2.Механизм","3.Цвет","4.Материал кольца","5. Тип зажима контактного блока","6.Наличие NO контактов","7.Наличие NC контактов","9.Напряжение сети","Положения",null,"Артикул","Ссылка"]
["M22P-FLLRP","Головка кнопки плоская прозрачная с фиксацией, красная","Плоская","Да","С фиксацией","Красный","Пластик",null,null,null,null,null,{"$f":"C2&E2&F2&G2&H2&I2&J2&D2&K2&L2","v":"ПлоскаяС фиксациейКрасныйПластикДа"},"M22P-FLLRP","https://www.dkc.ru/ru/catalog/2028/M22P-FLLRP/ "]
["M22P-FLLGP","Головка кнопки плоская прозрачная с фиксацией, зеленая","Плоская","Да","С фиксацией","Зелёный","Пластик",null,null,null,null,null,{"$f":"C3&E3&F3&G3&H3&I3&J3&D3&K3&L3","v":"ПлоскаяС фиксациейЗелёныйПластикДа"},"M22P-FLLGP","https://www.dkc.ru/ru/catalog/2028/M22P-FLLGP/ "]
["M22P-FLLBP","Головка кнопки плоская прозрачная с фиксацией, синяя","Плоская","Да","С фиксацией","Синий","Пластик",null,null,null,null,null,"ПлоскаяС фиксациейСинийПластикДа","M22P-FLLBP","https://www.dkc.ru/ru/catalog/2028/M22P-FLLBP/ "]
["M22P-FLLYP","Головка кнопки плоская прозрачная с фиксацией, жёлтая","Плоская","Да","С фиксацией","Жёлтый","Пластик",null,null,null,null,null,"ПлоскаяС фиксациейЖёлтыйПластикДа","M22P-FLLYP","https://www.dkc.ru/ru/catalog/2028/M22P-FLLYP/ "]
["M22P-FLLWP","Головка кнопки плоская прозрачная с фиксацией, белая","Плоская","Да","С фиксацией","Белый","Пластик",null,null,null,null,null,"ПлоскаяС фиксациейБелыйПластикДа","M22P-FLLWP","https://www.dkc.ru/ru/catalog/2028/M22P-FLLWP/ "]
["M22P-FMLRP","Головка кнопки плоская прозрачная без фиксации, красная","Плоская","Да","Без фиксации","Красный","Пластик",null,null,null,null,null,"ПлоскаяБез фиксацииКрасныйПластикДа","M22P-FMLRP","https://www.dkc.ru/ru/catalog/2028/M22P-FMLRP/ "]
["M22P-FMLGP","Головка кнопки плоская  прозрачная без фиксации, зеленая","Плоская","Да","Без фиксации","Зелёный","Пластик",null,null,null,null,null,"ПлоскаяБез фиксацииЗелёныйПластикДа","M22P-FMLGP","https://www.dkc.ru/ru/catalog/2028/M22P-FMLGP/ "]
["M22P-FMLYP","Головка кнопки плоская прозрачная без фиксации, желтая","Плоская","Да","Без фиксации","Жёлтый","Пластик",null,null,null,null,null,"ПлоскаяБез фиксацииЖёлтыйПластикДа","M22P-FMLYP","https://www.dkc.ru/ru/catalog/2028/M22P-FMLYP/ "]
["M22P-FMLBP","Головка кнопки плоская прозрачная без фиксации, синяя","Плоская","Да","Без фиксации","Синий","Пластик",null,null,null,null,null,"ПлоскаяБез фиксацииСинийПластикДа","M22P-FMLBP","https://www.dkc.ru/ru/catalog/2028/M22P-FMLBP/ "]
["M22P-FMLWP","Головка кнопки плоская прозрачная без фиксации, белая","Плоская","Да","Без фиксации","Белый","Пластик",null,null,null,null,null,"ПлоскаяБез фиксацииБелыйПластикДа","M22P-FMLWP","https://www.dkc.ru/ru/catalog/2028/M22P-FMLWP/ "]
["M22P-FMRP","Головка кнопки плоская без фиксации, красная","Плоская","Нет","Без фиксации","Красный","Пластик",null,null,null,null,null,"ПлоскаяБез фиксацииКрасныйПластикНет","M22P-FMRP","https://www.dkc.ru/ru/catalog/2028/M22P-FMRP/ "]
["M22P-FMGP","Головка кнопки плоская без фиксации, зеленая","Плоская","Нет","Без фиксации","Зелёный","Пластик",null,null,null,null,null,"ПлоскаяБез фиксацииЗелёныйПластикНет","M22P-FMGP","https://www.dkc.ru/ru/catalog/2028/M22P-FMGP/ "]
["M22P-FMBP","Головка кнопки плоская без фиксации, синяя","Плоская","Нет","Без фиксации","Синий","Пластик",null,null,null,null,null,"ПлоскаяБез фиксацииСинийПластикНет","M22P-FMBP","https://www.dkc.ru/ru/catalog/2028/M22P-FMBP/ "]
["M22P-FMWP","Головка кнопки плоская без фиксации, белая","Плоская","Нет","Без фиксации","Белый","Пластик",null,null,null,null,null,"ПлоскаяБез фиксацииБелыйПластикНет","M22P-FMWP","https://www.dkc.ru/ru/catalog/2028/M22P-FMWP/ "]
["M22P-FMYP","Головка кнопки плоская без фиксации, жёлтая","Плоская","Нет","Без фиксации","Жёлтый","Пластик",null,null,null,null,null,"ПлоскаяБез фиксацииЖёлтыйПластикНет","M22P-FMYP","https://www.dkc.ru/ru/catalog/2028/M22P-FMYP/ "]
["M22P-FMBLP","Головка кнопки плоская без фиксации, черная","Плоская","Нет","Без фиксации","Чёрный","Пластик",null,null,null,null,null,"ПлоскаяБез фиксацииЧёрныйПластикНет","M22P-FMBLP","https://www.dkc.ru/ru/catalog/2028/M22P-FMBLP/ "]
["M22E-MLLRP","Головка кнопки аварийная грибовидная поворотная д.40","Грибовидная","Да","С фиксацией","Красный","Пластик",null,null,null,null,null,"ГрибовиднаяС фиксациейКрасныйПластикДа","M22E-MLLRP","https://www.dkc.ru/ru/catalog/2028/M22E-MLLRP/ "]
["M22S-M2A","Головака переключателя на 2 положения с возвратом стандартная ручка, алюминий","Без ключа",null,"Без фиксации",null,"Алюминий",null,null,null,null,2,"Без ключаБез фиксацииАлюминий2","M22S-M2A","https://www.dkc.ru/ru/catalog/2028/M22S-M2A/"]
["M22S-L2A","Головака переключателя на 2 положения с фиксацией стандартная ручка, алюминий","Без ключа",null,"С фиксацией",null,"Алюминий",null,null,null,null,2,"Без ключаС фиксациейАлюминий2","M22S-L2A","https://www.dkc.ru/ru/catalog/2028/M22S-L2A/"]
["M22S-M3A","Головака переключателя на 3 положения с возвратом стандартная ручка, алюминий","Без ключа",null,"Без фиксации",null,"Алюминий",null,null,null,null,3,"Без ключаБез фиксацииАлюминий3","M22S-M3A","https://www.dkc.ru/ru/catalog/2028/M22S-M3A/"]
["M22S-L3A","Головака переключателя на 3 положения с фиксацией стандартная ручка, алюминий","Без ключа",null,"С фиксацией",null,"Алюминий",null,null,null,null,3,"Без ключаС фиксациейАлюминий3","M22S-L3A","https://www.dkc.ru/ru/catalog/2028/M22S-L3A/"]
["M22S-KM2A","Головака переключателя с ключом на 2 положения с возвратом стандартная ручка, алюминий","С ключом",null,"Без фиксации",null,"Алюминий",null,null,null,null,2,"С ключомБез фиксацииАлюминий2","M22S-KM2A","https://www.dkc.ru/ru/catalog/2028/M22S-KM2A/"]
["M22S-KL2A","Головака переключателя с ключом на 2 положения с фиксацией стандартная ручка, алюминий","С ключом",null,"С фиксацией",null,"Алюминий",null,null,null,null,2,"С ключомС фиксациейАлюминий2","M22S-KL2A","https://www.dkc.ru/ru/catalog/2028/M22S-KL2A/"]
["M22S-KM3A","Головака переключателя с ключом на 3 положения с возвратом стандартная ручка, алюминий","С ключом",null,"Без фиксации",null,"Алюминий",null,null,null,null,3,"С ключомБез фиксацииАлюминий3","M22S-KM3A","https://www.dkc.ru/ru/catalog/2028/M22S-KM3A/"]
["M22S-KL3A","Головака переключателя с ключом на 3 положения с фиксацией стандартная ручка, алюминий","С ключом",null,"С фиксацией",null,"Алюминий",null,null,null,null,3,"С ключомС фиксациейАлюминий3","M22S-KL3A","https://www.dkc.ru/ru/catalog/2028/M22S-KL3A/"]
["MC-NOPP","Контактный блок с клеммным безвинтовым  зажимом, нормально-открытый",null,null,null,null,null,"Безвинтовой Plug-In","Да","Нет",null,null,"Безвинтовой Plug-InДаНет","MC-NOPP","https://www.dkc.ru/ru/catalog/2028/MC-NOPP/"]
["MC-NCPP","Контактный блок  с клеммным безвинтовым зажимом, нормально-замкнутый",null,null,null,null,null,"Безвинтовой Plug-In","Нет","Да",null,null,"Безвинтовой Plug-InНетДа","MC-NCPP","https://www.dkc.ru/ru/catalog/2028/MC-NCPP/"]
["MC-L24RPP","Контактный  блок с клеммным безвинтовым зажимом со светодиодом на 9-24В, красный",null,"Да",null,"Красный",null,"Безвинтовой Plug-In",null,null,"9-24 В",null,"КрасныйБезвинтовой Plug-InДа9-24 В","MC-L24RPP","https://www.dkc.ru/ru/catalog/2028/MC-L24RPP/"]
["MC-L24GPP","Контактный  блок с клеммным безвинтовым зажимом со светодиодом на 9-24В, зелёный",null,"Да",null,"Зелёный",null,"Безвинтовой Plug-In",null,null,"9-24 В",null,"ЗелёныйБезвинтовой Plug-InДа9-24 В","MC-L24GPP","https://www.dkc.ru/ru/catalog/2028/MC-L24GPP/"]
{"$rows_left_out":151}
{"sheet":"Списки","index":3,"n_rows":28,"n_cols":10,"rows_kept":28,"cut":false,"hidden":true,"merged":[]}
["Кнопка"]
["1.Вид кнопки","2.Механизм","3.Цвет","4.Материал кольца","5. Тип зажима контактного блока","6.Наличие NO контактов","7.Наличие NC контактов","8.С возможностью подсветки","9.Напряжение сети","8. Количество NO контактов"]
["Плоская","С фиксацией","Красный","Пластик","Винтовой","Да","Да","Да","9-24 В",0]
["Грибовидная","Без фиксации","Зелёный","Алюминий","Безвинтовой Plug-In","Нет","Нет","Нет","220 В",1]
["Выпуклая",null,"Синий",null,null,null,null,null,"Нет",2]
[null,null,"Белый",null,null,null,null,null,null,3]
[null,null,"Жёлтый",null,null,null,null,null,null,4]
[null,null,"Чёрный",null,null,null,null,null,null,5]
[null,null,null,null,null,null,null,null,null,6]
[]
[]
[]
["Переклчатель"]
["1. Тип переключателя","2. Количество положений","3. Механизм","4.Материал","5.С возможностью подсветки","6.Напряжение сети","7.Цвет подсветки","8.Наличие NO контактов","9.Наличие NC контактов","8. Количество NO контактов"]
["С ключом",2,"С фиксацией","Пластик","Да","9-24 В","Красный","Да","Да",0]
["Без ключа",3,"Без фиксации","Алюминий",null,"220 В","Зелёный","Нет","Нет",1]
[null,null,null,null,null,null,"Синий",null,null,2]
[null,null,null,null,null,null,"Белый",null,null,3]
[null,null,null,null,null,null,"Жёлтый",null,null,4]
[null,null,null,null,null,null,null,null,null,5]
[null,null,null,null,null,null,null,null,null,6]
["Сигнальный инидкатор"]
["1.Цвет лампы","2.Напряжение сети","3.Тип зажима","4.Материал"]
["Красный","9-24 В","Безвинтовой Plug-In","Пластик"]
["Зелёный","220 В","Безвинтовой Push-In","Алюминий"]
["Синий"]
["Белый"]
["Жёлтый"]