{"text_format":"1","workbook":"xlsx","n_sheets":4,"sheets":["Конфигуратор","Лист1","Наименование","Списки"],"not_rendered":{"charts":0,"images":2,"macros":1,"external_links":0,"defined_names":4,"comments":0,"pivot_tables":0},"unopened":[],"bounds":{"document_bytes":16777216,"sheet_cells":100000,"rows_first":2000,"rows_last":500,"rows_between":2000,"halvings":0,"cell_chars":16384,"cell_head_chars":4096},"cells_cut":0,"cells_raw":0,"read":"whole","date_system":"1900"}

{"sheet":"Конфигуратор","index":0,"n_rows":623,"n_cols":12,"rows_kept":623,"cut":false,"hidden":false,"merged":[[4,0,4,2],[5,0,9,2],[5,4,9,8],[4,4,4,8],[67,0,67,1],[40,0,40,1],[14,0,14,1],[15,0,15,1],[15,4,15,8],[16,4,16,8]]}
[]
[]
[]
[]
["Конфигуратор Светосигнальной арматуры Mitra",null,null,null,"Спецификация"]
["Данный конфигуратор предназначен для подбора компонентов, необходимых для комплектации законченного устройства свтосигнальной арматуры Mitra.\nИнструкция:\n1. Выберите тип устройсва, который вы хотите собрать.\n2. Выберите его характеристики.",null,null,null,"Результат:\nВ разделе Спецификация указаны комплектующие, необходимые для сборки кнопки, переключателя или сигнального индикатора.\n\nНеобходимо подбирать компоненты, только из предложенных вариантов. Старая светосигнальная арматура M22 несовместима с новой."]
[null,null,null,null,null,null,null,null,null,{"$f":"\"\"","v":""}]
[]
[]
[]
[]
[]
[]
[null,null,null,null,null,null,null,null,null,null,null,"Содержимое заголовка"]
["Выбор параметров",null,null,null,"№ позиции","Артикул","Наименование","Количество","Ссылка",null,null,{"$f":"LEFT(E15,12)","v":"№ позиции"}]
["Кнопка",null,null,null,"Спецификация 1",null,null,null,null,null,null,{"$f":"LEFT(E16,12)","v":"Спецификация"}]
[null,null,null,null,"Кнопка",null,null,null,null,null,null,"Кнопка"]
["1. Вид кнопки:","Плоская",{"$f":"IF(B18=\"\",\"Выберите вид кнопки\",\"\")","v":""},null,1,"M22P-FLLRP","Головка кнопки плоская прозрачная с фиксацией, красная",1,"https://www.dkc.ru/ru/catalog/2028/M22P-FLLRP/",null,null,"1"]
[null,null,null,null,2,"M22MF","Монтажное основание для крепления головок кнопок, переключателей и контактных блоков",1,"https://www.dkc.ru/ru/catalog/2028/M22MF/",null,null,"2"]
["2. С возможностью подсветки","Да",{"$f":"IF(B18=\"Грибовидная\",IF(B20=\"\",\"Грибовидная кнопка с подсветкой 'Да'\",IF(B20=\"Да\",\"\",\"Выберите возможность подсветки  'Да'\")),IF(B20=\"\",\"Выберите возможность подсветки\",IF(B18&B20&B24=\"ПлоскаяДаЧёрный\",\"Плоская черная кнопка без подсветки\",\"\")))","v":""},null,3,"MC-L220RPS","Контактный блок с клеммными зажимами под винт со светодиодом на  220В, красный",1,"https://www.dkc.ru/ru/catalog/2028/MC-L220RPS/",null,null,"3"]
[null,null,null,null,4,"MC-NOPS","Контактный блок с клеммными зажимами под винт, нормально-открытый",1,"https://www.dkc.ru/ru/catalog/2028/MC-NOPS/",null,null,"4"]
["3. Механизм:","С фиксацией",{"$f":"IF(B18=\"Грибовидная\",IF(B22=\"Без фиксации\",\"Выберите механизм кнопки 'С фиксацией'\",IF(B22=\"\",\"Грибовидная кнопка 'С фиксацией'\",\"\")),IF(B22=\"\",IF(B20=\"Нет\",\"Кнопка без подсветки только 'Без фиксации'\",\"Выберите механизм кнопки\"),IF(B20=\"Нет\",IF(B22<>\"Без фиксации\",\"Выберите механизм кнопки 'Без фиксации'\",\"\"),\"\")))","v":""},null,5,"MC-NCPS","Контактный блок с клеммными зажимами под винт, нормально-замкнутый",2,"https://www.dkc.ru/ru/catalog/2028/MC-NCPS/",null,null,"5"]
[null,null,null,null,"",null,null,null,null,null,null,""]
["4. Цвет","Красный",{"$f":"IF(B18=\"Грибовидная\",IF(B24=\"Красный\",\"\",IF(B24=\"\",\"Грибовидная кнопка 'Красная'\",\"Выберите цвет 'Красный'\")),IF(B24=\"\",\"Выберите цвет кнопки\",IF(B18&B20&B24=\"ПлоскаяДаЧёрный\",\"Плоская черная кнопка без подсветки\",\"\")))","v":""},null,null,null,null,null,null,null,null,""]
[null,null,null,null,null,null,null,null,null,null,null,""]
["5. Материал кольца","Пластик",{"$f":"IF(B26=\"\",\"Выберите материал кольца\",\"\")","v":""},null,null,null,null,null,null,null,null,""]
[null,null,null,null,null,null,null,null,null,null,null,""]
["6. Тип зажима контактного блока","Винтовой",{"$f":"IF(B28=\"\",\"Выберите тип зажима\",\"\")","v":""},null,null,null,null,null,null,null,null,""]
[null,null,null,null,null,null,null,null,null,null,null,""]
["7. Наличие NO контактов","Да",{"$f":"IF(B30=\"\",\"Выберите наличие NO контактов\",IF(B30=\"Нет\",IF(B34=\"Нет\",\"Необходимо выбрать блоки с 'NO или NC контактами'\",\"\"),\"\"))","v":""},null,null,null,null,null,null,null,null,""]
{"$rows_left_out":594}
{"sheet":"Лист1","index":1,"n_rows":42,"n_cols":10,"rows_kept":42,"cut":false,"hidden":true,"merged":[[6,6,6,8],[1,1,1,5],[2,1,2,5],[9,1,9,5],[16,1,16,5]]}
[{"$f":"COUNTIF(Конфигуратор!L:L,\"Спецификация\")","v":1},"№ позиции","Артикул","Наименование","Количество","Ссылка"]
["Индекс",{"$f":"IF(SUM(B4:B18)=0,0,\"Спецификация \"&A1+1)","v":"Спецификация 2"}]
[{"$f":"IF(OR(C4=\"\",C4=\"Ошибка параметров ввода\",C5=\"Ошибка параметров ввода\",C6=\"Ошибка параметров ввода\",C7=\"Ошибка параметров ввода\",C8=\"Ошибка параметров ввода\"),0,1)","v":1},{"$f":"IF(SUM(A3:A7)=0,,\"Кнопка\")","v":"Кнопка"}]
[{"$f":"IF(OR(C5=\"\",C4=\"Ошибка параметров ввода\",C5=\"Ошибка параметров ввода\",C6=\"Ошибка параметров ввода\",C7=\"Ошибка параметров ввода\",C8=\"Ошибка параметров ввода\"),0,1)","v":1},{"$f":"IF(A3=1,A3,)","v":1},{"$f":"IFERROR(VLOOKUP(Конфигуратор!$B$18&Конфигуратор!$B$22&Конфигуратор!$B$24&Конфигуратор!$B$26&Конфигуратор!$B$20,Наименование!$M:$N,2,0),\"Ошибка параметров ввода\")","v":"M22P-FLLRP"},{"$f":"IFERROR(VLOOKUP(C4,Наименование!$A:$B,2,0),\"\")","v":"Головка кнопки плоская прозрачная с фиксацией, красная"},{"$f":"IF(C4=\"\",\"\",1)","v":1},{"$f":"VLOOKUP(C4,Наименование!A:O,15,0)","v":"https://www.dkc.ru/ru/catalog/2028/M22P-FLLRP/"}]
[{"$f":"IF(OR(C6=\"\",C4=\"Ошибка параметров ввода\",C5=\"Ошибка параметров ввода\",C6=\"Ошибка параметров ввода\",C7=\"Ошибка параметров ввода\",C8=\"Ошибка параметров ввода\"),0,1)","v":1},{"$f":"IF(A4>0,A4+B4,)","v":2},{"$f":"IF(C4=\"Ошибка параметров ввода\",\"\",\"M22MF\")","v":"M22MF"},{"$f":"IFERROR(VLOOKUP(C5,Наименование!$A:$B,2,0),\"\")","v":"Монтажное основание для крепления головок кнопок, переключателей и контактных блоков"},{"$f":"IF(C5=\"\",\"\",1)","v":1},{"$f":"VLOOKUP(C5,Наименование!A:O,15,0)","v":"https://www.dkc.ru/ru/catalog/2028/M22MF/"}]
[{"$f":"IF(OR(C7=\"\",C4=\"Ошибка параметров ввода\",C5=\"Ошибка параметров ввода\",C6=\"Ошибка параметров ввода\",C7=\"Ошибка параметров ввода\",C8=\"Ошибка параметров ввода\"),0,1)","v":1},{"$f":"IF(A5>0,A5+A4+A3,)","v":3},{"$f":"IFERROR(IF(Конфигуратор!$B$20=\"\",VLOOKUP(Конфигуратор!$B$24&Конфигуратор!$B$28&\"Нет\"&Конфигуратор!$B$38,Наименование!$M:$N,2,0),VLOOKUP(Конфигуратор!$B$24&Конфигуратор!$B$28&Конфигуратор!$B$20&Конфигуратор!$B$38,Наименование!$M:$N,2,0)),IF(Конфигуратор!$B$20=\"Да\",\"Ошибка параметров ввода\",\"\"))","v":"MC-L220RPS"},{"$f":"IFERROR(VLOOKUP(C6,Наименование!$A:$B,2,0),\"\")","v":"Контактный блок с клеммными зажимами под винт со светодиодом на  220В, красный"},{"$f":"IF(C6=\"\",\"\",1)","v":1},{"$f":"VLOOKUP(C6,Наименование!A:O,15,0)","v":"https://www.dkc.ru/ru/catalog/2028/MC-L220RPS/"}]
[{"$f":"IF(OR(C8=\"\",C4=\"Ошибка параметров ввода\",C5=\"Ошибка параметров ввода\",C6=\"Ошибка параметров ввода\",C7=\"Ошибка параметров ввода\",C8=\"Ошибка параметров ввода\"),0,1)","v":1},{"$f":"IF(A6>0,A6+A5+A4+A3,)","v":4},{"$f":"IF(Конфигуратор!$B$30=\"Да\",IF(Лист1!E7=0,\"Ошибка параметров ввода\",IFERROR(VLOOKUP(Конфигуратор!$B$28&Конфигуратор!$B$30&\"Нет\",Наименование!$M:$N,2,0),\"\")),IF(Конфигуратор!$B$34=\"Нет\",\"Ошибка параметров ввода\",\"\"))","v":"MC-NOPS"},{"$f":"IFERROR(VLOOKUP(C7,Наименование!$A:$B,2,0),\"\")","v":"Контактный блок с клеммными зажимами под винт, нормально-открытый"},{"$f":"Конфигуратор!$B$32","v":1},{"$f":"VLOOKUP(C7,Наименование!A:O,15,0)","v":"https://www.dkc.ru/ru/catalog/2028/MC-NOPS/"},"Пустая ячейка для заполнения",null,null," "]
[null,{"$f":"IF(A7>0,A7+A6+A5+A3+A4,)","v":5},{"$f":"IF(Конфигуратор!$B$34=\"Да\",IF(Лист1!E8=0,\"Ошибка параметров ввода\",IFERROR(VLOOKUP(Конфигуратор!$B$28&\"Нет\"&Конфигуратор!$B$34,Наименование!$M:$N,2,0),\"\")),IF(Конфигуратор!$B$30=\"Нет\",\"Ошибка параметров ввода\",\"\"))","v":"MC-NCPS"},{"$f":"IFERROR(VLOOKUP(C8,Наименование!$A:$B,2,0),\"\")","v":"Контактный блок с клеммными зажимами под винт, нормально-замкнутый"},{"$f":"Конфигуратор!$B$36","v":2},{"$f":"VLOOKUP(C8,Наименование!A:O,15,0)","v":"https://www.dkc.ru/ru/catalog/2028/MC-NCPS/"}]
[null,{"$f":"IF(B3=0,0,\"\")","v":""}]
[{"$f":"IF(OR(C11=\"\",C11=\"Ошибка параметров ввода\",C12=\"Ошибка параметров ввода\",C13=\"Ошибка параметров ввода\",C14=\"Ошибка параметров ввода\",C15=\"Ошибка параметров ввода\"),0,1)","v":0},{"$f":"IF(SUM(A10:A14)=0,,\"Переключатель\")","v":0}]
[{"$f":"IF(OR(C12=\"\",C11=\"Ошибка параметров ввода\",C12=\"Ошибка параметров ввода\",C13=\"Ошибка параметров ввода\",C14=\"Ошибка параметров ввода\",C15=\"Ошибка параметров ввода\"),0,1)","v":0},{"$f":"IF(A10=1,A10,)","v":0},{"$f":"IFERROR(VLOOKUP(Конфигуратор!$B$43&Конфигуратор!$B$47&Конфигуратор!$B$49&Конфигуратор!$B$45,Наименование!$M:$N,2,0),\"Ошибка параметров ввода\")","v":"Ошибка параметров ввода"},{"$f":"IFERROR(VLOOKUP(C11,Наименование!$A:$B,2,0),\"\")","v":""},{"$f":"IF(C11=\"\",\"\",1)","v":1},{"$f":"VLOOKUP(C11,Наименование!A:O,15,0)","v":{"$error":"#N/A"}}]
[{"$f":"IF(OR(C13=\"\",C11=\"Ошибка параметров ввода\",C12=\"Ошибка параметров ввода\",C13=\"Ошибка параметров ввода\",C14=\"Ошибка параметров ввода\",C15=\"Ошибка параметров ввода\"),0,1)","v":0},{"$f":"IF(A11>0,A11+B11,)","v":0},{"$f":"IF(C11=\"Ошибка параметров ввода\",\"\",\"M22MF\")","v":""},{"$f":"IFERROR(VLOOKUP(C12,Наименование!$A:$B,2,0),\"\")","v":""},{"$f":"IF(C12=\"\",\"\",1)","v":""},{"$f":"VLOOKUP(C12,Наименование!A:O,15,0)","v":{"$error":"#N/A"}}]
[{"$f":"IF(OR(C14=\"\",C11=\"Ошибка параметров ввода\",C12=\"Ошибка параметров ввода\",C13=\"Ошибка параметров ввода\",C14=\"Ошибка параметров ввода\",C15=\"Ошибка параметров ввода\"),0,1)","v":0},{"$f":"IF(A12>0,A12+A11+A10,)","v":0},{"$f":"IFERROR(IF(Конфигуратор!$B$51=\"Да\",VLOOKUP(Конфигуратор!$B$55&Конфигуратор!$B$57&Конфигуратор!$B$51&Конфигуратор!$B$53,Наименование!$M:$N,2,0),\"\"),\"\")","v":""},{"$f":"IFERROR(VLOOKUP(C13,Наименование!$A:$B,2,0),\"\")","v":""},{"$f":"IF(C13=\"\",\"\",1)","v":""},{"$f":"VLOOKUP(C13,Наименование!A:O,15,0)","v":{"$error":"#N/A"}}]
[{"$f":"IF(OR(C15=\"\",C11=\"Ошибка параметров ввода\",C12=\"Ошибка параметров ввода\",C13=\"Ошибка параметров ввода\",C14=\"Ошибка параметров ввода\",C15=\"Ошибка параметров ввода\"),0,1)","v":0},{"$f":"IF(A13>0,A13+A12+A11+A10,)","v":0},{"$f":"IF(Конфигуратор!$B$59=\"Да\",IF(Лист1!E14=0,\"Ошибка параметров ввода\",IFERROR(VLOOKUP(Конфигуратор!$B$57&Конфигуратор!$B$59&\"Нет\",Наименование!$M:$N,2,0),\"\")),IF(Конфигуратор!$B$63=\"Нет\",\"Ошибка параметров ввода\",\"\"))","v":""},{"$f":"IFERROR(VLOOKUP(C14,Наименование!$A:$B,2,0),\"\")","v":""},{"$f":"Конфигуратор!$B$61","v":""},{"$f":"VLOOKUP(C14,Наименование!A:O,15,0)","v":{"$error":"#N/A"}}]
[null,{"$f":"IF(A14>0,A14+A13+A12+A10+A11,)","v":0},{"$f":"IF(Конфигуратор!$B$63=\"Да\",IF(Лист1!E15=0,\"Ошибка параметров ввода\",IFERROR(VLOOKUP(Конфигуратор!$B$57&\"Нет\"&Конфигуратор!$B$63,Наименование!$M:$N,2,0),\"\")),IF(Конфигуратор!$B$59=\"Нет\",\"Ошибка параметров ввода\",\"\"))","v":""},{"$f":"IFERROR(VLOOKUP(C15,Наименование!$A:$B,2,0),\"\")","v":""},{"$f":"Конфигуратор!$B$65","v":""},{"$f":"VLOOKUP(C15,Наименование!A:O,15,0)","v":{"$error":"#N/A"}}]
[null,{"$f":"IF(B10=0,0,\"\")","v":0}]
[{"$f":"IF(C18=\"\",0,1)","v":0},{"$f":"IF(A17=0,,\"Сигнальный индикатор\")","v":0}]
[null,{"$f":"IF(A17>0,A17,)","v":0},{"$f":"IFERROR(VLOOKUP(Конфигуратор!$B$70&Конфигуратор!$B$76&Конфигуратор!$B$74&Конфигуратор!$B$72,Наименование!$M:$N,2,0),\"\")","v":""},{"$f":"IFERROR(VLOOKUP(C18,Наименование!A:B,2,0),\"\")","v":""},{"$f":"IF(C18=\"\",\"\",1)","v":""},{"$f":"VLOOKUP(C18,Наименование!A:O,15,0)","v":{"$error":"#N/A"}}]
[{"$f":"MAX(A3:A18)","v":1},{"$f":"IF(B17=0,0,\"\")","v":0},null,null,null,null,null,"J","B","Правила заполнения"]
[null,null,null,null,null,null,null,20,20,{"$f":"IF(Конфигуратор!$B$18=\"Грибовидная\",\"Да\",IF(Конфигуратор!$B$24=\"Чёрный\",\"Нет\",\"\"))","v":""}]
[]
[null,null,null,null,null,null,null,22,22,{"$f":"IF(Конфигуратор!$B$18=\"Грибовидная\",\"С фиксацией\",IF(Конфигуратор!$B$24=\"Чёрный\",\"Без фиксации\",IF(Конфигуратор!$B$20=\"Нет\",\"Без фиксации\",\"\")))","v":""}]
[]
[null,null,null,null,null,null,null,23,24,{"$f":"IF(Конфигуратор!$B$18=\"Грибовидная\",\"Красный\",\"\")","v":""}]
[]
[null,null,null,null,null,null,null,26,26]
[]
[null,null,null,null,null,null,null,28,32,{"$f":"IF(Конфигуратор!$B$30=\"Нет\",0,$J$7)","v":" "}]
[]
[null,null,null,null,null,null,null,30,36,{"$f":"IF(Конфигуратор!$B$34=\"Нет\",0,$J$7)","v":" "}]
{"$rows_left_out":13}
{"sheet":"Наименование","index":2,"n_rows":104,"n_cols":15,"rows_kept":104,"cut":false,"hidden":true,"merged":[]}
["Артикул","Наименование","1.Вид кнопки","8.С возможностью подсветки","2.Механизм","3.Цвет","4.Материал кольца","5. Тип зажима контактного блока","6.Наличие NO контактов","7.Наличие NC контактов","9.Напряжение сети","Положения",null,"Артикул","Ссылка"]
["M22P-FLLRP","Головка кнопки плоская прозрачная с фиксацией, красная","Плоская","Да","С фиксацией","Красный","Пластик",null,null,null,null,null,{"$f":"C2&E2&F2&G2&H2&I2&J2&D2&K2&L2","v":"ПлоскаяС фиксациейКрасныйПластикДа"},"M22P-FLLRP","https://www.dkc.ru/ru/catalog/2028/M22P-FLLRP/"]
["M22P-FLLGP","Головка кнопки плоская прозрачная с фиксацией, зеленая","Плоская","Да","С фиксацией","Зелёный","Пластик",null,null,null,null,null,{"$f":"C3&E3&F3&G3&H3&I3&J3&D3&K3&L3","v":"ПлоскаяС фиксациейЗелёныйПластикДа"},"M22P-FLLGP","https://www.dkc.ru/ru/catalog/2028/M22P-FLLGP/"]
["M22P-FLLBP","Головка кнопки плоская прозрачная с фиксацией, синяя","Плоская","Да","С фиксацией","Синий","Пластик",null,null,null,null,null,"ПлоскаяС фиксациейСинийПластикДа","M22P-FLLBP","https://www.dkc.ru/ru/catalog/2028/M22P-FLLBP/"]
["M22P-FLLYP","Головка кнопки плоская прозрачная с фиксацией, жёлтая","Плоская","Да","С фиксацией","Жёлтый","Пластик",null,null,null,null,null,"ПлоскаяС фиксациейЖёлтыйПластикДа","M22P-FLLYP","https://www.dkc.ru/ru/catalog/2028/M22P-FLLYP/"]
["M22P-FLLWP","Головка кнопки плоская прозрачная с фиксацией, белая","Плоская","Да","С фиксацией","Белый","Пластик",null,null,null,null,null,"ПлоскаяС фиксациейБелыйПластикДа","M22P-FLLWP","https://www.dkc.ru/ru/catalog/2028/M22P-FLLWP/"]
["M22P-FMLRP","Головка кнопки плоская прозрачная без фиксации, красная","Плоская","Да","Без фиксации","Красный","Пластик",null,null,null,null,null,"ПлоскаяБез фиксацииКрасныйПластикДа","M22P-FMLRP","https://www.dkc.ru/ru/catalog/2028/M22P-FMLRP/"]
["M22P-FMLGP","Головка кнопки плоская  прозрачная без фиксации, зеленая","Плоская","Да","Без фиксации","Зелёный","Пластик",null,null,null,null,null,"ПлоскаяБез фиксацииЗелёныйПластикДа","M22P-FMLGP","https://www.dkc.ru/ru/catalog/2028/M22P-FMLGP/"]
["M22P-FMLYP","Головка кнопки плоская прозрачная без фиксации, желтая","Плоская","Да","Без фиксации","Жёлтый","Пластик",null,null,null,null,null,"ПлоскаяБез фиксацииЖёлтыйПластикДа","M22P-FMLYP","https://www.dkc.ru/ru/catalog/2028/M22P-FMLYP/"]
["M22P-FMLBP","Головка кнопки плоская прозрачная без фиксации, синяя","Плоская","Да","Без фиксации","Синий","Пластик",null,null,null,null,null,"ПлоскаяБез фиксацииСинийПластикДа","M22P-FMLBP","https://www.dkc.ru/ru/catalog/2028/M22P-FMLBP/"]
["M22P-FMLWP","Головка кнопки плоская прозрачная без фиксации, белая","Плоская","Да","Без фиксации","Белый","Пластик",null,null,null,null,null,"ПлоскаяБез фиксацииБелыйПластикДа","M22P-FMLWP","https://www.dkc.ru/ru/catalog/2028/M22P-FMLWP/"]
["M22P-FMRP","Головка кнопки плоская без фиксации, красная","Плоская","Нет","Без фиксации","Красный","Пластик",null,null,null,null,null,"ПлоскаяБез фиксацииКрасныйПластикНет","M22P-FMRP","https://www.dkc.ru/ru/catalog/2028/M22P-FMRP/"]
["M22P-FMGP","Головка кнопки плоская без фиксации, зеленая","Плоская","Нет","Без фиксации","Зелёный","Пластик",null,null,null,null,null,"ПлоскаяБез фиксацииЗелёныйПластикНет","M22P-FMGP","https://www.dkc.ru/ru/catalog/2028/M22P-FMGP/"]
["M22P-FMBP","Головка кнопки плоская без фиксации, синяя","Плоская","Нет","Без фиксации","Синий","Пластик",null,null,null,null,null,"ПлоскаяБез фиксацииСинийПластикНет","M22P-FMBP","https://www.dkc.ru/ru/catalog/2028/M22P-FMBP/"]
["M22P-FMWP","Головка кнопки плоская без фиксации, белая","Плоская","Нет","Без фиксации","Белый","Пластик",null,null,null,null,null,"ПлоскаяБез фиксацииБелыйПластикНет","M22P-FMWP","https://www.dkc.ru/ru/catalog/2028/M22P-FMWP/"]
["M22P-FMYP","Головка кнопки плоская без фиксации, жёлтая","Плоская","Нет","Без фиксации","Жёлтый","Пластик",null,null,null,null,null,"ПлоскаяБез фиксацииЖёлтыйПластикНет","M22P-FMYP","https://www.dkc.ru/ru/catalog/2028/M22P-FMYP/"]
["M22P-FMBLP","Головка кнопки плоская без фиксации, черная","Плоская","Нет","Без фиксации","Чёрный","Пластик",null,null,null,null,null,"ПлоскаяБез фиксацииЧёрныйПластикНет","M22P-FMBLP","https://www.dkc.ru/ru/catalog/2028/M22P-FMBLP/"]
["M22E-MLLRP","Головка кнопки аварийная грибовидная поворотная д.40","Грибовидная","Да","С фиксацией","Красный","Пластик",null,null,null,null,null,"ГрибовиднаяС фиксациейКрасныйПластикДа","M22E-MLLRP","https://www.dkc.ru/ru/catalog/2028/M22E-MLLRP/"]
["M22L-F220RPP","Сигнальный индикатор со встроенным диодом 220В, красный, зажим Plug-In",null,null,null,"Красный","Пластик","Безвинтовой Plug-In",null,null,"220 В",null,"КрасныйПластикБезвинтовой Plug-In220 В","M22L-F220RPP","https://www.dkc.ru/ru/catalog/2028/M22L-F220RPP/"]
["M22L-F24RPP","Сигнальный индикатор со встроенным диодом 24В, красный, зажим Plug-In",null,null,null,"Красный","Пластик","Безвинтовой Plug-In",null,null,"9-24 В",null,"КрасныйПластикБезвинтовой Plug-In9-24 В","M22L-F24RPP","https://www.dkc.ru/ru/catalog/2028/M22L-F24RPP/"]
["M22L-F220GPP","Сигнальный индикатор со встроенным диодом 220В, зеленый, зажим Plug-In",null,null,null,"Зелёный","Пластик","Безвинтовой Plug-In",null,null,"220 В",null,"ЗелёныйПластикБезвинтовой Plug-In220 В","M22L-F220GPP","https://www.dkc.ru/ru/catalog/2028/M22L-F220GPP/"]
["M22L-F24GPP","Сигнальный индикатор со встроенным диодом 24В, зеленый, зажим Plug-In",null,null,null,"Зелёный","Пластик","Безвинтовой Plug-In",null,null,"9-24 В",null,"ЗелёныйПластикБезвинтовой Plug-In9-24 В","M22L-F24GPP","https://www.dkc.ru/ru/catalog/2028/M22L-F24GPP/"]
["M22L-F220YPP","Сигнальный индикатор со встроенным диодом 220В, желтый, зажим Plug-In",null,null,null,"Жёлтый","Пластик","Безвинтовой Plug-In",null,null,"220 В",null,"ЖёлтыйПластикБезвинтовой Plug-In220 В","M22L-F220YPP","https://www.dkc.ru/ru/catalog/2028/M22L-F220YPP/"]
["M22L-F24YPP","Сигнальный индикатор со встроенным диодом 24В, желтый, зажим Plug-In",null,null,null,"Жёлтый","Пластик","Безвинтовой Plug-In",null,null,"9-24 В",null,"ЖёлтыйПластикБезвинтовой Plug-In9-24 В","M22L-F24YPP","https://www.dkc.ru/ru/catalog/2028/M22L-F24YPP/"]
["M22L-F220WPP","Сигнальный индикатор со встроенным диодом 220В, белый, зажим Plug-In",null,null,null,"Белый","Пластик","Безвинтовой Plug-In",null,null,"220 В",null,"БелыйПластикБезвинтовой Plug-In220 В","M22L-F220WPP","https://www.dkc.ru/ru/catalog/2028/M22L-F220WPP/"]
["M22L-F24WPP","Сигнальный индикатор со встроенным диодом 24В, белый, зажим Plug-In",null,null,null,"Белый","Пластик","Безвинтовой Plug-In",null,null,"9-24 В",null,"БелыйПластикБезвинтовой Plug-In9-24 В","M22L-F24WPP","https://www.dkc.ru/ru/catalog/2028/M22L-F24WPP/"]
["M22L-F220BPP","Сигнальный индикатор со встроенным диодом 220В, синий, зажим Plug-In",null,null,null,"Синий","Пластик","Безвинтовой Plug-In",null,null,"220 В",null,"СинийПластикБезвинтовой Plug-In220 В","M22L-F220BPP","https://www.dkc.ru/ru/catalog/2028/M22L-F220BPP/"]
["M22L-F24BPP","Сигнальный индикатор со встроенным диодом 24В, синий, зажим Plug-In",null,null,null,"Синий","Пластик","Безвинтовой Plug-In",null,null,"9-24 В",null,"СинийПластикБезвинтовой Plug-In9-24 В","M22L-F24BPP","https://www.dkc.ru/ru/catalog/2028/M22L-F24BPP/"]
["M22S-M2A","Головака переключателя на 2 положения с возвратом стандартная ручка, алюминий","Без ключа",null,"Без фиксации",null,"Алюминий",null,null,null,null,2,"Без ключаБез фиксацииАлюминий2","M22S-M2A","https://www.dkc.ru/ru/catalog/2028/M22S-M2A/"]
["M22S-L2A","Головака переключателя на 2 положения с фиксацией стандартная ручка, алюминий","Без ключа",null,"С фиксацией",null,"Алюминий",null,null,null,null,2,"Без ключаС фиксациейАлюминий2","M22S-L2A","https://www.dkc.ru/ru/catalog/2028/M22S-L2A/"]
{"$rows_left_out":75}
{"sheet":"Списки","index":3,"n_rows":28,"n_cols":10,"rows_kept":28,"cut":false,"hidden":true,"merged":[]}
["Кнопка"]
["1.Вид кнопки","2.Механизм","3.Цвет","4.Материал кольца","5. Тип зажима контактного блока","6.Наличие NO контактов","7.Наличие NC контактов","8.С возможностью подсветки","9.Напряжение сети","8. Количество NO контактов"]
["Плоская","С фиксацией","Красный","Пластик","Винтовой","Да","Да","Да","9-24 В",0]
["Грибовидная","Без фиксации","Зелёный","Алюминий","Безвинтовой Plug-In","Нет","Нет","Нет","220 В",1]
[null,null,"Синий",null,null,null,null,null,"Нет",2]
[null,null,"Белый",null,null,null,null,null,null,3]
[null,null,"Жёлтый",null,null,null,null,null,null,4]
[null,null,"Чёрный",null,null,null,null,null,null,5]
[null,null,null,null,null,null,null,null,null,6]
[]
[]
[]
["Переклчатель"]
["1. Тип переключателя","2. Количество положений","3. Механизм","4.Материал","5.С возможностью подсветки","6.Напряжение сети","7.Цвет подсветки","8.Наличие NO контактов","9.Наличие NC контактов","8. Количество NO контактов"]
["С ключом",2,"С фиксацией","Пластик","Да","9-24 В","Красный","Да","Да",0]
["Без ключа",3,"Без фиксации","Алюминий",null,"220 В","Зелёный","Нет","Нет",1]
[null,null,null,null,null,null,"Синий",null,null,2]
[null,null,null,null,null,null,"Белый",null,null,3]
[null,null,null,null,null,null,"Жёлтый",null,null,4]
[null,null,null,null,null,null,null,null,null,5]
[null,null,null,null,null,null,null,null,null,6]
["Сигнальный инидкатор"]
["1.Цвет лампы","2.Напряжение сети","3.Тип зажима","4.Материал"]
["Красный","9-24 В","Безвинтовой Plug-In","Пластик"]
["Зелёный","220 В",null,"Алюминий"]
["Синий"]
["Белый"]
["Жёлтый"]